776 JYB


776JYB is registered to a Blue 1960, Morris Minor 1000 with a Petrol engine. It Failed its most recent MOT Test on the 24 May 2017

24 unique faults (32 Total) reported in its MOT History (18 Tests).

6 common/recurring faults, the most frequent (4 times) is: Child seat fitted not allowing full inspection of adult belt.

67% (12) MOT Pass Rate and a 33% (6) MOT Failure Rate.

35,570 recorded miles.

776 JYB


776JYB is registered to a Blue 1960, Morris Minor 1000 with a Petrol engine. It Failed its most recent MOT Test on the 24 May 2017

24 unique faults (32 Total) reported in its MOT History (18 Tests).

6 common/recurring faults, the most frequent (4 times) is: Child seat fitted not allowing full inspection of adult belt.

67% (12) MOT Pass Rate and a 33% (6) MOT Failure Rate.

35,570 recorded miles.

MOT PASS/Failure rate for 776 JYB

all MOT test results for 776 JYB represented as a percentage
MOT PASS/Failure rate for 776 JYB
all MOT test results for 776 JYB represented as a percentage

PERCENTAGE OF VEHICLE FAULTS WITH 776 JYB

ALL REPORTED FAULTS, DISPLAYED BY PERCENTAGE OF OCCURRENCE DURING ALL MOT TESTS
PERCENTAGE OF VEHICLE FAULTS WITH 776 JYB
ALL REPORTED FAULTS, DISPLAYED BY PERCENTAGE OF OCCURRENCE DURING ALL MOT TESTS
ADVISORY

FAIL

USER ENTERED

PASS WITH RECTIFICATION

776 JYB annual Faults by type

ALL REPORTED FAULTS, DISPLAYED over time and categorised by type
776 JYB annual Faults by type
ALL REPORTED FAULTS, DISPLAYED over time and categorised by type

RECURRING FAULTS WITH 776 JYB

FAULTS THAT HAVE OCCURED MORE THAN ONCE DURING 776 JYB's MOT HISTORY
RECURRING FAULTS WITH 776 JYB
FAULTS THAT HAVE OCCURED MORE THAN ONCE DURING 776 JYB's MOT HISTORY
Fault Fault Test Date Test Date/Time Reference MOT Test Reference
4 Child seat fitted not allowing full inspection of adult belt Child seat fitted not allowing full inspection of adult belt 15 May 2014 [15:43] 15/05/2014 13 May 2014 [11:06] 13/05/2014 29 April 2013 [16:31] 29/04/2013 29 April 2013 [16:31] 29/04/2013 235165734165 235165734165 775323134173 775323134173 828479613161 828479613161 298489513441 298489513441
2 Rear child seat fitted not allowing full inspection of adult belt both () Rear child seat fitted not allowing full inspection of adult belt both () 24 May 2017 [14:17] 24/05/2017 19 May 2017 [14:14] 19/05/2017 781156995548 781156995548 299855629298 299855629298
2 Nearside front child seat fitted not allowing full inspection of adult belt () Nearside front child seat fitted not allowing full inspection of adult belt () 24 May 2017 [14:17] 24/05/2017 19 May 2017 [14:14] 19/05/2017 781156995548 781156995548 299855629298 299855629298
2 Offside headlamp not working on dipped beam (1.7.5a) Offside headlamp not working on dipped beam (1.7.5a) 13 May 2015 [10:39] 13/05/2015 29 April 2013 [16:31] 29/04/2013 296283035183 296283035183 298489513441 298489513441
2 Offside front steering rack gaiter deteriorated (2.2.d.2d) Offside front steering rack gaiter deteriorated (2.2.d.2d) 15 May 2014 [15:43] 15/05/2014 13 May 2014 [11:06] 13/05/2014 235165734165 235165734165 775323134173 775323134173
2 Oil leak Oil leak 15 May 2014 [15:43] 15/05/2014 13 May 2014 [11:06] 13/05/2014 235165734165 235165734165 775323134173 775323134173

ALL 776 JYB ADVISORIES [7]

ALL ADVISORIES, ORDERED by OCCURRENCE DURING 776 JYB's MOT HISTORY
ALL 776 JYB ADVISORIES [7]
ALL ADVISORIES, ORDERED by OCCURRENCE DURING 776 JYB's MOT HISTORY
Advisory Faults | source www.vehiclestats.co.uk
Fault Fault Test Date Test Date/Time Reference MOT Test Reference
2 Rear child seat fitted not allowing full inspection of adult belt both () Rear child seat fitted not allowing full inspection of adult belt both () 24 May 2017 [14:17] 24/05/2017 19 May 2017 [14:14] 19/05/2017 781156995548 781156995548 299855629298 299855629298
2 Nearside front child seat fitted not allowing full inspection of adult belt () Nearside front child seat fitted not allowing full inspection of adult belt () 24 May 2017 [14:17] 24/05/2017 19 May 2017 [14:14] 19/05/2017 781156995548 781156995548 299855629298 299855629298
2 Offside front steering rack gaiter deteriorated (2.2.d.2d) Offside front steering rack gaiter deteriorated (2.2.d.2d) 15 May 2014 [15:43] 15/05/2014 13 May 2014 [11:06] 13/05/2014 235165734165 235165734165 775323134173 775323134173
1 Nearside front tyre perished & cracked Nearside front tyre perished & cracked 19 May 2017 [14:14] 19/05/2017 299855629298 299855629298

ALL 776 JYB Failure Faults [13]

ALL Failure faults, ORDERED by OCCURRENCE DURING 776 JYB's MOT HISTORY
ALL 776 JYB Failure Faults [13]
ALL Failure faults, ORDERED by OCCURRENCE DURING 776 JYB's MOT HISTORY
Fail Faults | source www.vehiclestats.co.uk
Fault Fault Test Date Test Date/Time Reference MOT Test Reference
1 Offside stop lamp not working (1.2.1b) Offside stop lamp not working (1.2.1b) 19 May 2017 [14:14] 19/05/2017 299855629298 299855629298
1 Offside front tyre has ply or cords exposed 145/80r14 76t (4.1.d.1b) Offside front tyre has ply or cords exposed 145/80r14 76t (4.1.d.1b) 19 May 2017 [14:14] 19/05/2017 299855629298 299855629298
1 Nearside front brake binding (3.7.b.1) Nearside front brake binding (3.7.b.1) 19 May 2017 [14:14] 19/05/2017 299855629298 299855629298
1 Offside rear shock absorber has a serious fluid leak (2.7.3) Offside rear shock absorber has a serious fluid leak (2.7.3) 19 May 2017 [14:14] 19/05/2017 299855629298 299855629298
1 Front brake application uneven (3.7.b.2) Front brake application uneven (3.7.b.2) 19 May 2017 [14:14] 19/05/2017 299855629298 299855629298
1 Parking brake: efficiency below requirements (3.7.b.7) Parking brake: efficiency below requirements (3.7.b.7) 16 May 2016 [11:06] 16/05/2016 404230125939 404230125939
1 Brakes imbalanced across an axle (3.7.b.5b) Brakes imbalanced across an axle (3.7.b.5b) 16 May 2016 [11:06] 16/05/2016 404230125939 404230125939
1 Registration plate lamp not working (1.1.c.1d) Registration plate lamp not working (1.1.c.1d) 16 May 2016 [11:06] 16/05/2016 404230125939 404230125939
1 Headlamp not working on dipped beam (1.7.5a) Headlamp not working on dipped beam (1.7.5a) 16 May 2016 [11:06] 16/05/2016 404230125939 404230125939
1 Front fuel hose leaking (7.2.3) Front fuel hose leaking (7.2.3) 13 May 2014 [11:06] 13/05/2014 775323134173 775323134173
1 Exhaust has a major leak of exhaust gases (7.1.2) Exhaust has a major leak of exhaust gases (7.1.2) 13 May 2014 [11:06] 13/05/2014 775323134173 775323134173
1 Nearside rear tyre has ply or cords exposed (4.1.d.1b) Nearside rear tyre has ply or cords exposed (4.1.d.1b) 13 May 2014 [11:06] 13/05/2014 775323134173 775323134173
1 Nearside front windscreen washer provides insufficient washer liquid (8.2.3) Nearside front windscreen washer provides insufficient washer liquid (8.2.3) 13 May 2014 [11:06] 13/05/2014 775323134173 775323134173

ALL 776 JYB User Entered Faults [6]

ALL User Entered faults, ORDERED by OCCURRENCE DURING 776 JYB's MOT HISTORY
ALL 776 JYB User Entered Faults [6]
ALL User Entered faults, ORDERED by OCCURRENCE DURING 776 JYB's MOT HISTORY
Advisory Faults | source www.vehiclestats.co.uk
Fault Fault Test Date Test Date/Time Reference MOT Test Reference
4 Child seat fitted not allowing full inspection of adult belt Child seat fitted not allowing full inspection of adult belt 15 May 2014 [15:43] 15/05/2014 13 May 2014 [11:06] 13/05/2014 29 April 2013 [16:31] 29/04/2013 29 April 2013 [16:31] 29/04/2013 235165734165 235165734165 775323134173 775323134173 828479613161 828479613161 298489513441 298489513441
2 Oil leak Oil leak 15 May 2014 [15:43] 15/05/2014 13 May 2014 [11:06] 13/05/2014 235165734165 235165734165 775323134173 775323134173

ALL 776 JYB Pass With Rectification Faults [6]

ALL Pass With Rectification faults, ORDERED by OCCURRENCE DURING 776 JYB's MOT HISTORY
ALL 776 JYB Pass With Rectification Faults [6]
ALL Pass With Rectification faults, ORDERED by OCCURRENCE DURING 776 JYB's MOT HISTORY
Pass With Rectification Faults | source www.vehiclestats.co.uk
Fault Fault Test Date Test Date/Time Reference MOT Test Reference
2 Offside headlamp not working on dipped beam (1.7.5a) Offside headlamp not working on dipped beam (1.7.5a) 13 May 2015 [10:39] 13/05/2015 29 April 2013 [16:31] 29/04/2013 296283035183 296283035183 298489513441 298489513441
1 Offside headlamp aim too high (1.8) Offside headlamp aim too high (1.8) 13 May 2015 [10:39] 13/05/2015 296283035183 296283035183
1 Offside registration plate lamp not working (1.1.c.1d) Offside registration plate lamp not working (1.1.c.1d) 13 May 2015 [10:39] 13/05/2015 296283035183 296283035183
1 Nearside headlamp not working on dipped beam (1.7.5a) Nearside headlamp not working on dipped beam (1.7.5a) 29 April 2013 [16:31] 29/04/2013 298489513441 298489513441
1 Offside rear stop lamp not working (1.2.1b) Offside rear stop lamp not working (1.2.1b) 09 March 2009 [18:24] 09/03/2009 213778369035 213778369035

MOT TEST: 24 May 2017 14:17:01 PASSED
MOT TEST: 24 May 2017 14:17:01 PASSED

This test (781156995548) was completed on the 24 May 2017 14:17:01 and PASSED the requirements for a valid MOT with 2 comments.

This test (781156995548) was completed on the 24 May 2017 14:17:01 and PASSED the requirements for a valid MOT with 2 comments.

Recorded mileage: 35,570

Recorded mileage: 35,570


ADVISORY


MOT TEST: 19 May 2017 14:14:57 FAILED
MOT TEST: 19 May 2017 14:14:57 FAILED

This test (299855629298) was completed on the 19 May 2017 14:14:57 and FAILED the requirements for a valid MOT with 8 comments.

This test (299855629298) was completed on the 19 May 2017 14:14:57 and FAILED the requirements for a valid MOT with 8 comments.

Recorded mileage: 35,559

Recorded mileage: 35,559


ADVISORY

FAIL


MOT TEST: 19 May 2016 12:03:57 PASSED
MOT TEST: 19 May 2016 12:03:57 PASSED

This test (688515989751) was completed on the 19 May 2016 12:03:57 and PASSED the requirements for a valid MOT with 0 comments.

This test (688515989751) was completed on the 19 May 2016 12:03:57 and PASSED the requirements for a valid MOT with 0 comments.

Recorded mileage: 34,262

Recorded mileage: 34,262


MOT TEST: 16 May 2016 11:06:47 FAILED
MOT TEST: 16 May 2016 11:06:47 FAILED

This test (404230125939) was completed on the 16 May 2016 11:06:47 and FAILED the requirements for a valid MOT with 4 comments.

This test (404230125939) was completed on the 16 May 2016 11:06:47 and FAILED the requirements for a valid MOT with 4 comments.

Recorded mileage: 34,252

Recorded mileage: 34,252


FAIL


MOT TEST: 13 May 2015 10:39:02 PASSED
MOT TEST: 13 May 2015 10:39:02 PASSED

This test (255273035174) was completed on the 13 May 2015 10:39:02 and PASSED the requirements for a valid MOT with 0 comments.

This test (255273035174) was completed on the 13 May 2015 10:39:02 and PASSED the requirements for a valid MOT with 0 comments.

Recorded mileage: 33,114

Recorded mileage: 33,114


MOT TEST: 13 May 2015 10:39:02 FAILED
MOT TEST: 13 May 2015 10:39:02 FAILED

This test (296283035183) was completed on the 13 May 2015 10:39:02 and FAILED the requirements for a valid MOT with 3 comments.

This test (296283035183) was completed on the 13 May 2015 10:39:02 and FAILED the requirements for a valid MOT with 3 comments.

Recorded mileage: 33,114

Recorded mileage: 33,114


PASS WITH RECTIFICATION


MOT TEST: 15 May 2014 15:43:40 PASSED
MOT TEST: 15 May 2014 15:43:40 PASSED

This test (235165734165) was completed on the 15 May 2014 15:43:40 and PASSED the requirements for a valid MOT with 3 comments.

This test (235165734165) was completed on the 15 May 2014 15:43:40 and PASSED the requirements for a valid MOT with 3 comments.

Recorded mileage: 32,663

Recorded mileage: 32,663


ADVISORY

USER ENTERED


MOT TEST: 13 May 2014 11:06:13 FAILED
MOT TEST: 13 May 2014 11:06:13 FAILED

This test (775323134173) was completed on the 13 May 2014 11:06:13 and FAILED the requirements for a valid MOT with 7 comments.

This test (775323134173) was completed on the 13 May 2014 11:06:13 and FAILED the requirements for a valid MOT with 7 comments.

Recorded mileage: 32,658

Recorded mileage: 32,658


ADVISORY

FAIL

USER ENTERED


MOT TEST: 29 April 2013 16:31:46 PASSED
MOT TEST: 29 April 2013 16:31:46 PASSED

This test (828479613161) was completed on the 29 April 2013 16:31:46 and PASSED the requirements for a valid MOT with 1 comments.

This test (828479613161) was completed on the 29 April 2013 16:31:46 and PASSED the requirements for a valid MOT with 1 comments.

Recorded mileage: 31,159

Recorded mileage: 31,159


USER ENTERED


MOT TEST: 29 April 2013 16:31:46 FAILED
MOT TEST: 29 April 2013 16:31:46 FAILED

This test (298489513441) was completed on the 29 April 2013 16:31:46 and FAILED the requirements for a valid MOT with 3 comments.

This test (298489513441) was completed on the 29 April 2013 16:31:46 and FAILED the requirements for a valid MOT with 3 comments.

Recorded mileage: 31,159

Recorded mileage: 31,159


USER ENTERED

PASS WITH RECTIFICATION


MOT TEST: 04 May 2012 15:40:04 PASSED
MOT TEST: 04 May 2012 15:40:04 PASSED

This test (525445222171) was completed on the 04 May 2012 15:40:04 and PASSED the requirements for a valid MOT with 0 comments.

This test (525445222171) was completed on the 04 May 2012 15:40:04 and PASSED the requirements for a valid MOT with 0 comments.

Recorded mileage: 27,282

Recorded mileage: 27,282


MOT TEST: 14 March 2011 17:08:36 PASSED
MOT TEST: 14 March 2011 17:08:36 PASSED

This test (748873871036) was completed on the 14 March 2011 17:08:36 and PASSED the requirements for a valid MOT with 0 comments.

This test (748873871036) was completed on the 14 March 2011 17:08:36 and PASSED the requirements for a valid MOT with 0 comments.

Recorded mileage: 25,569

Recorded mileage: 25,569


MOT TEST: 17 March 2010 17:19:52 PASSED
MOT TEST: 17 March 2010 17:19:52 PASSED

This test (792866870047) was completed on the 17 March 2010 17:19:52 and PASSED the requirements for a valid MOT with 0 comments.

This test (792866870047) was completed on the 17 March 2010 17:19:52 and PASSED the requirements for a valid MOT with 0 comments.

Recorded mileage: 24,036

Recorded mileage: 24,036


MOT TEST: 09 March 2009 18:24:07 PASSED
MOT TEST: 09 March 2009 18:24:07 PASSED

This test (972808769006) was completed on the 09 March 2009 18:24:07 and PASSED the requirements for a valid MOT with 0 comments.

This test (972808769006) was completed on the 09 March 2009 18:24:07 and PASSED the requirements for a valid MOT with 0 comments.

Recorded mileage: 21,979

Recorded mileage: 21,979


MOT TEST: 09 March 2009 18:24:07 FAILED
MOT TEST: 09 March 2009 18:24:07 FAILED

This test (213778369035) was completed on the 09 March 2009 18:24:07 and FAILED the requirements for a valid MOT with 1 comments.

This test (213778369035) was completed on the 09 March 2009 18:24:07 and FAILED the requirements for a valid MOT with 1 comments.

Recorded mileage: 21,979

Recorded mileage: 21,979


PASS WITH RECTIFICATION


MOT TEST: 26 February 2008 18:52:12 PASSED
MOT TEST: 26 February 2008 18:52:12 PASSED

This test (511867058090) was completed on the 26 February 2008 18:52:12 and PASSED the requirements for a valid MOT with 0 comments.

This test (511867058090) was completed on the 26 February 2008 18:52:12 and PASSED the requirements for a valid MOT with 0 comments.

Recorded mileage: 20,456

Recorded mileage: 20,456


MOT TEST: 28 February 2007 16:44:13 PASSED
MOT TEST: 28 February 2007 16:44:13 PASSED

This test (984249857075) was completed on the 28 February 2007 16:44:13 and PASSED the requirements for a valid MOT with 0 comments.

This test (984249857075) was completed on the 28 February 2007 16:44:13 and PASSED the requirements for a valid MOT with 0 comments.

Recorded mileage: 17,930

Recorded mileage: 17,930


MOT TEST: 03 March 2006 12:18:22 PASSED
MOT TEST: 03 March 2006 12:18:22 PASSED

This test (424262566098) was completed on the 03 March 2006 12:18:22 and PASSED the requirements for a valid MOT with 0 comments.

This test (424262566098) was completed on the 03 March 2006 12:18:22 and PASSED the requirements for a valid MOT with 0 comments.

Recorded mileage: 17,214

Recorded mileage: 17,214