783 BBX


783BBX is registered to a Black 1962, Morris Minor with a Petrol engine. It Failed its most recent MOT Test on the 19 May 2017

43 unique faults (54 Total) reported in its MOT History (16 Tests).

8 common/recurring faults, the most frequent (4 times) is: Nearside Front wheel bearing has slight play (2.5.A.3c).

69% (11) MOT Pass Rate and a 31% (5) MOT Failure Rate.

74,526 recorded miles.

783 BBX


783BBX is registered to a Black 1962, Morris Minor with a Petrol engine. It Failed its most recent MOT Test on the 19 May 2017

43 unique faults (54 Total) reported in its MOT History (16 Tests).

8 common/recurring faults, the most frequent (4 times) is: Nearside Front wheel bearing has slight play (2.5.A.3c).

69% (11) MOT Pass Rate and a 31% (5) MOT Failure Rate.

74,526 recorded miles.

MOT PASS/Failure rate for 783 BBX

all MOT test results for 783 BBX represented as a percentage
MOT PASS/Failure rate for 783 BBX
all MOT test results for 783 BBX represented as a percentage

PERCENTAGE OF VEHICLE FAULTS WITH 783 BBX

ALL REPORTED FAULTS, DISPLAYED BY PERCENTAGE OF OCCURRENCE DURING ALL MOT TESTS
PERCENTAGE OF VEHICLE FAULTS WITH 783 BBX
ALL REPORTED FAULTS, DISPLAYED BY PERCENTAGE OF OCCURRENCE DURING ALL MOT TESTS
ADVISORY

FAIL

USER ENTERED

PASS WITH RECTIFICATION

783 BBX annual Faults by type

ALL REPORTED FAULTS, DISPLAYED over time and categorised by type
783 BBX annual Faults by type
ALL REPORTED FAULTS, DISPLAYED over time and categorised by type

RECURRING FAULTS WITH 783 BBX

FAULTS THAT HAVE OCCURED MORE THAN ONCE DURING 783 BBX's MOT HISTORY
RECURRING FAULTS WITH 783 BBX
FAULTS THAT HAVE OCCURED MORE THAN ONCE DURING 783 BBX's MOT HISTORY
Fault Fault Test Date Test Date/Time Reference MOT Test Reference
4 Nearside front wheel bearing has slight play (2.5.a.3c) Nearside front wheel bearing has slight play (2.5.a.3c) 14 June 2016 [08:51] 14/06/2016 15 June 2015 [14:50] 15/06/2015 10 June 2013 [11:53] 10/06/2013 05 February 2008 [16:08] 05/02/2008 903213556190 903213556190 477526265149 477526265149 866081563108 866081563108 324506438081 324506438081
3 Offside front wheel bearing has slight play (2.5.a.3c) Offside front wheel bearing has slight play (2.5.a.3c) 14 June 2016 [08:51] 14/06/2016 15 June 2015 [14:50] 15/06/2015 10 June 2013 [11:53] 10/06/2013 903213556190 903213556190 477526265149 477526265149 866081563108 866081563108
2 Nearside front inner sill corroded and holed Nearside front inner sill corroded and holed 19 May 2017 [14:57] 19/05/2017 18 May 2017 [09:09] 18/05/2017 607948950745 607948950745 612785038129 612785038129
2 Nearside front wheel binding by hand Nearside front wheel binding by hand 19 May 2017 [14:57] 19/05/2017 18 May 2017 [09:09] 18/05/2017 607948950745 607948950745 612785038129 612785038129
2 Slight play nearside front upper trunion. Slight play nearside front upper trunion. 16 June 2014 [14:54] 16/06/2014 12 June 2014 [11:09] 12/06/2014 307347364137 307347364137 459393464168 459393464168
2 Slight play offside lower trunion. Slight play offside lower trunion. 16 June 2014 [14:54] 16/06/2014 12 June 2014 [11:09] 12/06/2014 307347364137 307347364137 459393464168 459393464168
2 Offside front suspension component mounting prescribed area is excessively corroded (2.4.a.3) Offside front suspension component mounting prescribed area is excessively corroded (2.4.a.3) 12 June 2014 [11:09] 12/06/2014 18 January 2007 [11:30] 18/01/2007 459393464168 459393464168 152258917415 152258917415
2 Nearside front suspension component mounting prescribed area is excessively corroded (2.4.a.3) Nearside front suspension component mounting prescribed area is excessively corroded (2.4.a.3) 12 April 2010 [10:55] 12/04/2010 18 January 2007 [11:30] 18/01/2007 364172400195 364172400195 152258917415 152258917415

ALL 783 BBX ADVISORIES [11]

ALL ADVISORIES, ORDERED by OCCURRENCE DURING 783 BBX's MOT HISTORY
ALL 783 BBX ADVISORIES [11]
ALL ADVISORIES, ORDERED by OCCURRENCE DURING 783 BBX's MOT HISTORY
Advisory Faults | source www.vehiclestats.co.uk
Fault Fault Test Date Test Date/Time Reference MOT Test Reference
4 Nearside front wheel bearing has slight play (2.5.a.3c) Nearside front wheel bearing has slight play (2.5.a.3c) 14 June 2016 [08:51] 14/06/2016 15 June 2015 [14:50] 15/06/2015 10 June 2013 [11:53] 10/06/2013 05 February 2008 [16:08] 05/02/2008 903213556190 903213556190 477526265149 477526265149 866081563108 866081563108 324506438081 324506438081
3 Offside front wheel bearing has slight play (2.5.a.3c) Offside front wheel bearing has slight play (2.5.a.3c) 14 June 2016 [08:51] 14/06/2016 15 June 2015 [14:50] 15/06/2015 10 June 2013 [11:53] 10/06/2013 903213556190 903213556190 477526265149 477526265149 866081563108 866081563108
2 Nearside front inner sill corroded and holed Nearside front inner sill corroded and holed 19 May 2017 [14:57] 19/05/2017 18 May 2017 [09:09] 18/05/2017 607948950745 607948950745 612785038129 612785038129
2 Nearside front wheel binding by hand Nearside front wheel binding by hand 19 May 2017 [14:57] 19/05/2017 18 May 2017 [09:09] 18/05/2017 607948950745 607948950745 612785038129 612785038129

ALL 783 BBX Failure Faults [26]

ALL Failure faults, ORDERED by OCCURRENCE DURING 783 BBX's MOT HISTORY
ALL 783 BBX Failure Faults [26]
ALL Failure faults, ORDERED by OCCURRENCE DURING 783 BBX's MOT HISTORY
Fail Faults | source www.vehiclestats.co.uk
Fault Fault Test Date Test Date/Time Reference MOT Test Reference
2 Offside front suspension component mounting prescribed area is excessively corroded (2.4.a.3) Offside front suspension component mounting prescribed area is excessively corroded (2.4.a.3) 12 June 2014 [11:09] 12/06/2014 18 January 2007 [11:30] 18/01/2007 459393464168 459393464168 152258917415 152258917415
2 Nearside front suspension component mounting prescribed area is excessively corroded (2.4.a.3) Nearside front suspension component mounting prescribed area is excessively corroded (2.4.a.3) 12 April 2010 [10:55] 12/04/2010 18 January 2007 [11:30] 18/01/2007 364172400195 364172400195 152258917415 152258917415
1 Rear rear position lamp(s) not working both (1.1.a.3b) Rear rear position lamp(s) not working both (1.1.a.3b) 18 May 2017 [09:09] 18/05/2017 612785038129 612785038129
1 Registration plate lamp not working (1.1.c.1d) Registration plate lamp not working (1.1.c.1d) 18 May 2017 [09:09] 18/05/2017 612785038129 612785038129
1 Nearside headlamp not working on dipped beam (1.7.5a) Nearside headlamp not working on dipped beam (1.7.5a) 18 May 2017 [09:09] 18/05/2017 612785038129 612785038129
1 Offside headlamp not working on main beam (1.7.5a) Offside headlamp not working on main beam (1.7.5a) 18 May 2017 [09:09] 18/05/2017 612785038129 612785038129
1 Nearside front direction indicator not working (1.4.a.2c) Nearside front direction indicator not working (1.4.a.2c) 18 May 2017 [09:09] 18/05/2017 612785038129 612785038129
1 Nearside headlamp aim not tested (1.8.a.1c) Nearside headlamp aim not tested (1.8.a.1c) 18 May 2017 [09:09] 18/05/2017 612785038129 612785038129
1 Brake pipe leaking front to rear (3.6.a.1) Brake pipe leaking front to rear (3.6.a.1) 18 May 2017 [09:09] 18/05/2017 612785038129 612785038129
1 Windscreen washer provides insufficient washer liquid both (8.2.3) Windscreen washer provides insufficient washer liquid both (8.2.3) 18 May 2017 [09:09] 18/05/2017 612785038129 612785038129
1 Parking brake: efficiency below requirements (3.7.b.7) Parking brake: efficiency below requirements (3.7.b.7) 18 May 2017 [09:09] 18/05/2017 612785038129 612785038129
1 All position lamps not working (1.1.a.3b) All position lamps not working (1.1.a.3b) 12 June 2014 [11:09] 12/06/2014 459393464168 459393464168
1 Offside front track rod end loose (2.2.b.1d) Offside front track rod end loose (2.2.b.1d) 12 June 2014 [11:09] 12/06/2014 459393464168 459393464168
1 Offside front front position lamp(s) not working (1.1.a.3b) Offside front front position lamp(s) not working (1.1.a.3b) 12 April 2010 [10:55] 12/04/2010 364172400195 364172400195
1 Exhaust has a major leak of exhaust gases (7.1.2) Exhaust has a major leak of exhaust gases (7.1.2) 12 April 2010 [10:55] 12/04/2010 364172400195 364172400195
1 Rear exhaust system not adequately supported (7.1.1) Rear exhaust system not adequately supported (7.1.1) 12 April 2010 [10:55] 12/04/2010 364172400195 364172400195
1 Offside rear mechanical brake component has restricted free movement (3.5.1k) Offside rear mechanical brake component has restricted free movement (3.5.1k) 12 April 2010 [10:55] 12/04/2010 364172400195 364172400195
1 Offside rear an item not tested (manual) Offside rear an item not tested (manual) 12 April 2010 [10:55] 12/04/2010 364172400195 364172400195
1 Nearside rear suspension component mounting prescribed area is excessively corroded (2.4.a.3) Nearside rear suspension component mounting prescribed area is excessively corroded (2.4.a.3) 12 April 2010 [10:55] 12/04/2010 364172400195 364172400195
1 Offside rear suspension component mounting prescribed area is excessively corroded (2.4.a.3) Offside rear suspension component mounting prescribed area is excessively corroded (2.4.a.3) 12 April 2010 [10:55] 12/04/2010 364172400195 364172400195
1 Steering rack gaiter split (2.2.d.2d) Steering rack gaiter split (2.2.d.2d) 12 April 2010 [10:55] 12/04/2010 364172400195 364172400195
1 Offside inner front suspension component mounting prescribed area is excessively corroded (2.4.a.3) Offside inner front suspension component mounting prescribed area is excessively corroded (2.4.a.3) 12 April 2010 [10:55] 12/04/2010 364172400195 364172400195
1 Offside headlamp not working on dipped beam (1.7.5a) Offside headlamp not working on dipped beam (1.7.5a) 18 January 2007 [11:30] 18/01/2007 152258917415 152258917415
1 Offside rear position lamp(s) excessively deteriorated so that it is not visible from a reasonable distance (1.1.a.3d) Offside rear position lamp(s) excessively deteriorated so that it is not visible from a reasonable distance (1.1.a.3d) 18 January 2007 [11:30] 18/01/2007 152258917415 152258917415

ALL 783 BBX User Entered Faults [10]

ALL User Entered faults, ORDERED by OCCURRENCE DURING 783 BBX's MOT HISTORY
ALL 783 BBX User Entered Faults [10]
ALL User Entered faults, ORDERED by OCCURRENCE DURING 783 BBX's MOT HISTORY
User Entered Faults | source www.vehiclestats.co.uk
Fault Fault Test Date Test Date/Time Reference MOT Test Reference
2 Slight play nearside front upper trunion. Slight play nearside front upper trunion. 16 June 2014 [14:54] 16/06/2014 12 June 2014 [11:09] 12/06/2014 307347364137 307347364137 459393464168 459393464168
2 Slight play offside lower trunion. Slight play offside lower trunion. 16 June 2014 [14:54] 16/06/2014 12 June 2014 [11:09] 12/06/2014 307347364137 307347364137 459393464168 459393464168
1 Nearside rear inner wheel slighty damp but not wet, investergate brake cylinder needed. Nearside rear inner wheel slighty damp but not wet, investergate brake cylinder needed. 10 June 2013 [11:53] 10/06/2013 866081563108 866081563108
1 Abnormal brake peformance values,due to installation of brake servo. Abnormal brake peformance values,due to installation of brake servo. 06 May 2010 [14:31] 06/05/2010 154526720134 154526720134
1 O/s rear inner wheel arch badly holed and corroded O/s rear inner wheel arch badly holed and corroded 12 April 2010 [10:55] 12/04/2010 364172400195 364172400195
1 Handbrake has slack Handbrake has slack 12 April 2010 [10:55] 12/04/2010 364172400195 364172400195
1 O/s/f side light dim O/s/f side light dim 08 April 2009 [13:44] 08/04/2009 733858099022 733858099022
1 Various repairs to vehicle underside and structure, all heavily painted with liberal amounts of paint and under seal Various repairs to vehicle underside and structure, all heavily painted with liberal amounts of paint and under seal 05 February 2008 [16:08] 05/02/2008 324506438081 324506438081

ALL 783 BBX Pass With Rectification Faults [7]

ALL Pass With Rectification faults, ORDERED by OCCURRENCE DURING 783 BBX's MOT HISTORY
ALL 783 BBX Pass With Rectification Faults [7]
ALL Pass With Rectification faults, ORDERED by OCCURRENCE DURING 783 BBX's MOT HISTORY
Pass With Rectification Faults | source www.vehiclestats.co.uk
Fault Fault Test Date Test Date/Time Reference MOT Test Reference
1 Offside front upper steering wheel in a condition that hampers proper control (2.1.1) Offside front upper steering wheel in a condition that hampers proper control (2.1.1) 03 May 2011 [16:47] 03/05/2011 527753321168 527753321168
1 Offside rear rear brake binding (3.7.b.1) Offside rear rear brake binding (3.7.b.1) 03 May 2011 [16:47] 03/05/2011 527753321168 527753321168
1 Offside front all position lamps not working (1.1.a.3b) Offside front all position lamps not working (1.1.a.3b) 03 May 2011 [16:47] 03/05/2011 527753321168 527753321168
1 Nearside rear all position lamps not working (1.1.a.3b) Nearside rear all position lamps not working (1.1.a.3b) 03 May 2011 [16:47] 03/05/2011 527753321168 527753321168
1 Nearside rear stop lamp not working (1.2.1b) Nearside rear stop lamp not working (1.2.1b) 03 May 2011 [16:47] 03/05/2011 527753321168 527753321168
1 Nearside front windscreen washer provides insufficient washer liquid (8.2.3) Nearside front windscreen washer provides insufficient washer liquid (8.2.3) 03 May 2011 [16:47] 03/05/2011 527753321168 527753321168
1 Offside front windscreen washer provides insufficient washer liquid (8.2.3) Offside front windscreen washer provides insufficient washer liquid (8.2.3) 03 May 2011 [16:47] 03/05/2011 527753321168 527753321168

MOT TEST: 19 May 2017 14:57:07 PASSED
MOT TEST: 19 May 2017 14:57:07 PASSED

This test (607948950745) was completed on the 19 May 2017 14:57:07 and PASSED the requirements for a valid MOT with 2 comments.

This test (607948950745) was completed on the 19 May 2017 14:57:07 and PASSED the requirements for a valid MOT with 2 comments.

Recorded mileage: 74,526

Recorded mileage: 74,526


ADVISORY


MOT TEST: 18 May 2017 09:09:28 FAILED
MOT TEST: 18 May 2017 09:09:28 FAILED

This test (612785038129) was completed on the 18 May 2017 09:09:28 and FAILED the requirements for a valid MOT with 11 comments.

This test (612785038129) was completed on the 18 May 2017 09:09:28 and FAILED the requirements for a valid MOT with 11 comments.

Recorded mileage: 74,526

Recorded mileage: 74,526


ADVISORY

FAIL


MOT TEST: 14 June 2016 08:51:42 PASSED
MOT TEST: 14 June 2016 08:51:42 PASSED

This test (903213556190) was completed on the 14 June 2016 08:51:42 and PASSED the requirements for a valid MOT with 2 comments.

This test (903213556190) was completed on the 14 June 2016 08:51:42 and PASSED the requirements for a valid MOT with 2 comments.

Recorded mileage: 74,342

Recorded mileage: 74,342


ADVISORY


MOT TEST: 15 June 2015 14:50:05 PASSED
MOT TEST: 15 June 2015 14:50:05 PASSED

This test (477526265149) was completed on the 15 June 2015 14:50:05 and PASSED the requirements for a valid MOT with 2 comments.

This test (477526265149) was completed on the 15 June 2015 14:50:05 and PASSED the requirements for a valid MOT with 2 comments.

Recorded mileage: 73,605

Recorded mileage: 73,605


ADVISORY


MOT TEST: 16 June 2014 14:54:05 PASSED
MOT TEST: 16 June 2014 14:54:05 PASSED

This test (307347364137) was completed on the 16 June 2014 14:54:05 and PASSED the requirements for a valid MOT with 2 comments.

This test (307347364137) was completed on the 16 June 2014 14:54:05 and PASSED the requirements for a valid MOT with 2 comments.

Recorded mileage: 71,708

Recorded mileage: 71,708


USER ENTERED


MOT TEST: 12 June 2014 11:09:03 FAILED
MOT TEST: 12 June 2014 11:09:03 FAILED

This test (459393464168) was completed on the 12 June 2014 11:09:03 and FAILED the requirements for a valid MOT with 5 comments.

This test (459393464168) was completed on the 12 June 2014 11:09:03 and FAILED the requirements for a valid MOT with 5 comments.

Recorded mileage: 71,708

Recorded mileage: 71,708


FAIL

USER ENTERED


MOT TEST: 10 June 2013 11:53:23 PASSED
MOT TEST: 10 June 2013 11:53:23 PASSED

This test (866081563108) was completed on the 10 June 2013 11:53:23 and PASSED the requirements for a valid MOT with 3 comments.

This test (866081563108) was completed on the 10 June 2013 11:53:23 and PASSED the requirements for a valid MOT with 3 comments.

Recorded mileage: 69,247

Recorded mileage: 69,247


ADVISORY

USER ENTERED


MOT TEST: 12 June 2012 14:33:45 PASSED
MOT TEST: 12 June 2012 14:33:45 PASSED

This test (735814562111) was completed on the 12 June 2012 14:33:45 and PASSED the requirements for a valid MOT with 0 comments.

This test (735814562111) was completed on the 12 June 2012 14:33:45 and PASSED the requirements for a valid MOT with 0 comments.

Recorded mileage: 67,498

Recorded mileage: 67,498


MOT TEST: 03 May 2011 16:47:45 PASSED
MOT TEST: 03 May 2011 16:47:45 PASSED

This test (758243921182) was completed on the 03 May 2011 16:47:45 and PASSED the requirements for a valid MOT with 0 comments.

This test (758243921182) was completed on the 03 May 2011 16:47:45 and PASSED the requirements for a valid MOT with 0 comments.

Recorded mileage: 66,552

Recorded mileage: 66,552


MOT TEST: 03 May 2011 16:47:45 FAILED
MOT TEST: 03 May 2011 16:47:45 FAILED

This test (527753321168) was completed on the 03 May 2011 16:47:45 and FAILED the requirements for a valid MOT with 7 comments.

This test (527753321168) was completed on the 03 May 2011 16:47:45 and FAILED the requirements for a valid MOT with 7 comments.

Recorded mileage: 66,552

Recorded mileage: 66,552


PASS WITH RECTIFICATION


MOT TEST: 06 May 2010 14:31:27 PASSED
MOT TEST: 06 May 2010 14:31:27 PASSED

This test (154526720134) was completed on the 06 May 2010 14:31:27 and PASSED the requirements for a valid MOT with 1 comments.

This test (154526720134) was completed on the 06 May 2010 14:31:27 and PASSED the requirements for a valid MOT with 1 comments.

Recorded mileage: 65,190

Recorded mileage: 65,190


USER ENTERED


MOT TEST: 12 April 2010 10:55:27 FAILED
MOT TEST: 12 April 2010 10:55:27 FAILED

This test (364172400195) was completed on the 12 April 2010 10:55:27 and FAILED the requirements for a valid MOT with 12 comments.

This test (364172400195) was completed on the 12 April 2010 10:55:27 and FAILED the requirements for a valid MOT with 12 comments.

Recorded mileage: 65,183

Recorded mileage: 65,183


FAIL

USER ENTERED


MOT TEST: 08 April 2009 13:44:33 PASSED
MOT TEST: 08 April 2009 13:44:33 PASSED

This test (733858099022) was completed on the 08 April 2009 13:44:33 and PASSED the requirements for a valid MOT with 1 comments.

This test (733858099022) was completed on the 08 April 2009 13:44:33 and PASSED the requirements for a valid MOT with 1 comments.

Recorded mileage: 64,428

Recorded mileage: 64,428


USER ENTERED


MOT TEST: 05 February 2008 16:08:59 PASSED
MOT TEST: 05 February 2008 16:08:59 PASSED

This test (324506438081) was completed on the 05 February 2008 16:08:59 and PASSED the requirements for a valid MOT with 2 comments.

This test (324506438081) was completed on the 05 February 2008 16:08:59 and PASSED the requirements for a valid MOT with 2 comments.

Recorded mileage: 63,723

Recorded mileage: 63,723


ADVISORY

USER ENTERED


MOT TEST: 25 January 2007 15:42:26 PASSED
MOT TEST: 25 January 2007 15:42:26 PASSED

This test (683245827012) was completed on the 25 January 2007 15:42:26 and PASSED the requirements for a valid MOT with 0 comments.

This test (683245827012) was completed on the 25 January 2007 15:42:26 and PASSED the requirements for a valid MOT with 0 comments.

Recorded mileage: 63,440

Recorded mileage: 63,440


MOT TEST: 18 January 2007 11:30:53 FAILED
MOT TEST: 18 January 2007 11:30:53 FAILED

This test (152258917415) was completed on the 18 January 2007 11:30:53 and FAILED the requirements for a valid MOT with 4 comments.

This test (152258917415) was completed on the 18 January 2007 11:30:53 and FAILED the requirements for a valid MOT with 4 comments.

Recorded mileage: 63,440

Recorded mileage: 63,440


FAIL