799 FOV


799FOV is registered to a Grey 1962, Morris Minor with a Petrol engine. It Passed its most recent MOT Test on the 22 May 2018

25 unique faults (32 Total) reported in its MOT History (12 Tests).

6 common/recurring faults, the most frequent (3 times) is: Rear Brake pipe slightly corroded 2 (3.6.B.2c).

67% (8) MOT Pass Rate and a 33% (4) MOT Failure Rate.

37,188 recorded miles.

799 FOV


799FOV is registered to a Grey 1962, Morris Minor with a Petrol engine. It Passed its most recent MOT Test on the 22 May 2018

25 unique faults (32 Total) reported in its MOT History (12 Tests).

6 common/recurring faults, the most frequent (3 times) is: Rear Brake pipe slightly corroded 2 (3.6.B.2c).

67% (8) MOT Pass Rate and a 33% (4) MOT Failure Rate.

37,188 recorded miles.

MOT PASS/Failure rate for 799 FOV

all MOT test results for 799 FOV represented as a percentage
MOT PASS/Failure rate for 799 FOV
all MOT test results for 799 FOV represented as a percentage

PERCENTAGE OF VEHICLE FAULTS WITH 799 FOV

ALL REPORTED FAULTS, DISPLAYED BY PERCENTAGE OF OCCURRENCE DURING ALL MOT TESTS
PERCENTAGE OF VEHICLE FAULTS WITH 799 FOV
ALL REPORTED FAULTS, DISPLAYED BY PERCENTAGE OF OCCURRENCE DURING ALL MOT TESTS
ADVISORY

FAIL

799 FOV annual Faults by type

ALL REPORTED FAULTS, DISPLAYED over time and categorised by type
799 FOV annual Faults by type
ALL REPORTED FAULTS, DISPLAYED over time and categorised by type

RECURRING FAULTS WITH 799 FOV

FAULTS THAT HAVE OCCURED MORE THAN ONCE DURING 799 FOV's MOT HISTORY
RECURRING FAULTS WITH 799 FOV
FAULTS THAT HAVE OCCURED MORE THAN ONCE DURING 799 FOV's MOT HISTORY
Fault Fault Test Date Test Date/Time Reference MOT Test Reference
3 Rear brake pipe slightly corroded 2 (3.6.b.2c) Rear brake pipe slightly corroded 2 (3.6.b.2c) 16 May 2017 [11:15] 16/05/2017 16 May 2017 [09:43] 16/05/2017 03 May 2016 [09:40] 03/05/2016 214105944077 214105944077 356725102649 356725102649 548410298591 548410298591
2 Offside front brake pipe slightly corroded (3.6.b.2c) Offside front brake pipe slightly corroded (3.6.b.2c) 16 May 2017 [11:15] 16/05/2017 16 May 2017 [09:43] 16/05/2017 214105944077 214105944077 356725102649 356725102649
2 Offside front brake hose has slight corrosion to ferrules (3.6.b.4e) Offside front brake hose has slight corrosion to ferrules (3.6.b.4e) 16 May 2017 [11:15] 16/05/2017 16 May 2017 [09:43] 16/05/2017 214105944077 214105944077 356725102649 356725102649
2 Nearside front brake hose has slight corrosion to ferrules (3.6.b.4e) Nearside front brake hose has slight corrosion to ferrules (3.6.b.4e) 16 May 2017 [11:15] 16/05/2017 16 May 2017 [09:43] 16/05/2017 214105944077 214105944077 356725102649 356725102649
2 Offside steering rack gaiter split (2.2.d.2d) Offside steering rack gaiter split (2.2.d.2d) 30 April 2014 [12:01] 30/04/2014 20 January 2011 [10:52] 20/01/2011 359580624145 359580624145 156410921410 156410921410
2 Brake pedal spongy (3.3.b.1b) Brake pedal spongy (3.3.b.1b) 16 May 2013 [11:07] 16/05/2013 20 January 2011 [10:52] 20/01/2011 358026633152 358026633152 156410921410 156410921410

ALL 799 FOV ADVISORIES [15]

ALL ADVISORIES, ORDERED by OCCURRENCE DURING 799 FOV's MOT HISTORY
ALL 799 FOV ADVISORIES [15]
ALL ADVISORIES, ORDERED by OCCURRENCE DURING 799 FOV's MOT HISTORY
Advisory Faults | source www.vehiclestats.co.uk
Fault Fault Test Date Test Date/Time Reference MOT Test Reference
3 Rear brake pipe slightly corroded 2 (3.6.b.2c) Rear brake pipe slightly corroded 2 (3.6.b.2c) 16 May 2017 [11:15] 16/05/2017 16 May 2017 [09:43] 16/05/2017 03 May 2016 [09:40] 03/05/2016 214105944077 214105944077 356725102649 356725102649 548410298591 548410298591
2 Offside front brake pipe slightly corroded (3.6.b.2c) Offside front brake pipe slightly corroded (3.6.b.2c) 16 May 2017 [11:15] 16/05/2017 16 May 2017 [09:43] 16/05/2017 214105944077 214105944077 356725102649 356725102649
2 Offside front brake hose has slight corrosion to ferrules (3.6.b.4e) Offside front brake hose has slight corrosion to ferrules (3.6.b.4e) 16 May 2017 [11:15] 16/05/2017 16 May 2017 [09:43] 16/05/2017 214105944077 214105944077 356725102649 356725102649
2 Nearside front brake hose has slight corrosion to ferrules (3.6.b.4e) Nearside front brake hose has slight corrosion to ferrules (3.6.b.4e) 16 May 2017 [11:15] 16/05/2017 16 May 2017 [09:43] 16/05/2017 214105944077 214105944077 356725102649 356725102649
1 Offside rear brake pipe corroded, covered in grease or other material (1.1.11 (c)) Offside rear brake pipe corroded, covered in grease or other material (1.1.11 (c)) 22 May 2018 [11:30] 22/05/2018 137828874150 137828874150
1 Nearside rear brake pipe corroded, covered in grease or other material (1.1.11 (c)) Nearside rear brake pipe corroded, covered in grease or other material (1.1.11 (c)) 22 May 2018 [11:30] 22/05/2018 137828874150 137828874150
1 Offside front upper suspension component pin or bush slightly worn (5.3.4 (a) (i)) Offside front upper suspension component pin or bush slightly worn (5.3.4 (a) (i)) 22 May 2018 [11:30] 22/05/2018 137828874150 137828874150
1 Nearside front upper suspension component pin or bush slightly worn (5.3.4 (a) (i)) Nearside front upper suspension component pin or bush slightly worn (5.3.4 (a) (i)) 22 May 2018 [11:30] 22/05/2018 137828874150 137828874150
1 Offside front upper suspension arm has slight play in a pin/bush (2.4.g.2) Offside front upper suspension arm has slight play in a pin/bush (2.4.g.2) 03 May 2016 [09:40] 03/05/2016 548410298591 548410298591
1 Nsf brake binding Nsf brake binding 03 May 2016 [09:40] 03/05/2016 548410298591 548410298591

ALL 799 FOV Failure Faults [17]

ALL Failure faults, ORDERED by OCCURRENCE DURING 799 FOV's MOT HISTORY
ALL 799 FOV Failure Faults [17]
ALL Failure faults, ORDERED by OCCURRENCE DURING 799 FOV's MOT HISTORY
Fail Faults | source www.vehiclestats.co.uk
Fault Fault Test Date Test Date/Time Reference MOT Test Reference
2 Offside steering rack gaiter split (2.2.d.2d) Offside steering rack gaiter split (2.2.d.2d) 30 April 2014 [12:01] 30/04/2014 20 January 2011 [10:52] 20/01/2011 359580624145 359580624145 156410921410 156410921410
2 Brake pedal spongy (3.3.b.1b) Brake pedal spongy (3.3.b.1b) 16 May 2013 [11:07] 16/05/2013 20 January 2011 [10:52] 20/01/2011 358026633152 358026633152 156410921410 156410921410
1 Fuel pipe leaking (7.2.3) Fuel pipe leaking (7.2.3) 16 May 2017 [09:43] 16/05/2017 356725102649 356725102649
1 Nearside stop lamp remains on when the brakes are released (1.2.1e) Nearside stop lamp remains on when the brakes are released (1.2.1e) 30 April 2014 [12:01] 30/04/2014 359580624145 359580624145
1 Offside stop lamp remains on when the brakes are released (1.2.1e) Offside stop lamp remains on when the brakes are released (1.2.1e) 30 April 2014 [12:01] 30/04/2014 359580624145 359580624145
1 Nearside front front brake binding (3.7.b.1) Nearside front front brake binding (3.7.b.1) 30 April 2014 [12:01] 30/04/2014 359580624145 359580624145
1 Nearside rear front brake binding (3.7.b.1) Nearside rear front brake binding (3.7.b.1) 30 April 2014 [12:01] 30/04/2014 359580624145 359580624145
1 Nearside steering rack gaiter split (2.2.d.2d) Nearside steering rack gaiter split (2.2.d.2d) 16 May 2013 [11:07] 16/05/2013 358026633152 358026633152
1 Nearside front brake recording little or no effort (3.7.b.5a) Nearside front brake recording little or no effort (3.7.b.5a) 16 May 2013 [11:07] 16/05/2013 358026633152 358026633152
1 Offside front brake recording little or no effort (3.7.b.5a) Offside front brake recording little or no effort (3.7.b.5a) 16 May 2013 [11:07] 16/05/2013 358026633152 358026633152
1 Nearside rear brake recording little or no effort (3.7.b.5a) Nearside rear brake recording little or no effort (3.7.b.5a) 16 May 2013 [11:07] 16/05/2013 358026633152 358026633152
1 Offside rear brake recording little or no effort (3.7.b.5a) Offside rear brake recording little or no effort (3.7.b.5a) 16 May 2013 [11:07] 16/05/2013 358026633152 358026633152
1 Service brake: efficiency below requirements (3.7.b.7) Service brake: efficiency below requirements (3.7.b.7) 16 May 2013 [11:07] 16/05/2013 358026633152 358026633152
1 Windscreen washer provides insufficient washer liquid (8.2.3) Windscreen washer provides insufficient washer liquid (8.2.3) 20 January 2011 [10:52] 20/01/2011 156410921410 156410921410
1 Rear fuel pipe leaking (7.2.3) Rear fuel pipe leaking (7.2.3) 20 January 2011 [10:52] 20/01/2011 156410921410 156410921410

MOT TEST: 22 May 2018 11:30:15 PASSED
MOT TEST: 22 May 2018 11:30:15 PASSED

This test (137828874150) was completed on the 22 May 2018 11:30:15 and PASSED the requirements for a valid MOT with 4 comments.

This test (137828874150) was completed on the 22 May 2018 11:30:15 and PASSED the requirements for a valid MOT with 4 comments.

Recorded mileage: 37,188

Recorded mileage: 37,188


ADVISORY


MOT TEST: 16 May 2017 11:15:47 PASSED
MOT TEST: 16 May 2017 11:15:47 PASSED

This test (214105944077) was completed on the 16 May 2017 11:15:47 and PASSED the requirements for a valid MOT with 4 comments.

This test (214105944077) was completed on the 16 May 2017 11:15:47 and PASSED the requirements for a valid MOT with 4 comments.

Recorded mileage: 37,179

Recorded mileage: 37,179


ADVISORY


MOT TEST: 16 May 2017 09:43:01 FAILED
MOT TEST: 16 May 2017 09:43:01 FAILED

This test (356725102649) was completed on the 16 May 2017 09:43:01 and FAILED the requirements for a valid MOT with 5 comments.

This test (356725102649) was completed on the 16 May 2017 09:43:01 and FAILED the requirements for a valid MOT with 5 comments.

Recorded mileage: 37,173

Recorded mileage: 37,173


ADVISORY

FAIL


MOT TEST: 03 May 2016 09:40:47 PASSED
MOT TEST: 03 May 2016 09:40:47 PASSED

This test (548410298591) was completed on the 03 May 2016 09:40:47 and PASSED the requirements for a valid MOT with 3 comments.

This test (548410298591) was completed on the 03 May 2016 09:40:47 and PASSED the requirements for a valid MOT with 3 comments.

Recorded mileage: 37,142

Recorded mileage: 37,142


ADVISORY


MOT TEST: 27 April 2015 11:20:59 PASSED
MOT TEST: 27 April 2015 11:20:59 PASSED

This test (996367815116) was completed on the 27 April 2015 11:20:59 and PASSED the requirements for a valid MOT with 0 comments.

This test (996367815116) was completed on the 27 April 2015 11:20:59 and PASSED the requirements for a valid MOT with 0 comments.

Recorded mileage: 37,127

Recorded mileage: 37,127


MOT TEST: 02 May 2014 08:41:46 PASSED
MOT TEST: 02 May 2014 08:41:46 PASSED

This test (848252124156) was completed on the 02 May 2014 08:41:46 and PASSED the requirements for a valid MOT with 0 comments.

This test (848252124156) was completed on the 02 May 2014 08:41:46 and PASSED the requirements for a valid MOT with 0 comments.

Recorded mileage: 37,101

Recorded mileage: 37,101


MOT TEST: 30 April 2014 12:01:34 FAILED
MOT TEST: 30 April 2014 12:01:34 FAILED

This test (359580624145) was completed on the 30 April 2014 12:01:34 and FAILED the requirements for a valid MOT with 5 comments.

This test (359580624145) was completed on the 30 April 2014 12:01:34 and FAILED the requirements for a valid MOT with 5 comments.

Recorded mileage: 37,101

Recorded mileage: 37,101


FAIL


MOT TEST: 21 May 2013 12:42:45 PASSED
MOT TEST: 21 May 2013 12:42:45 PASSED

This test (787171243192) was completed on the 21 May 2013 12:42:45 and PASSED the requirements for a valid MOT with 0 comments.

This test (787171243192) was completed on the 21 May 2013 12:42:45 and PASSED the requirements for a valid MOT with 0 comments.

Recorded mileage: 37,090

Recorded mileage: 37,090


MOT TEST: 16 May 2013 11:07:32 FAILED
MOT TEST: 16 May 2013 11:07:32 FAILED

This test (358026633152) was completed on the 16 May 2013 11:07:32 and FAILED the requirements for a valid MOT with 7 comments.

This test (358026633152) was completed on the 16 May 2013 11:07:32 and FAILED the requirements for a valid MOT with 7 comments.

Recorded mileage: 37,088

Recorded mileage: 37,088


FAIL


MOT TEST: 14 January 2012 10:29:06 PASSED
MOT TEST: 14 January 2012 10:29:06 PASSED

This test (905124112065) was completed on the 14 January 2012 10:29:06 and PASSED the requirements for a valid MOT with 0 comments.

This test (905124112065) was completed on the 14 January 2012 10:29:06 and PASSED the requirements for a valid MOT with 0 comments.

Recorded mileage: 37,081

Recorded mileage: 37,081


MOT TEST: 31 January 2011 14:37:57 PASSED
MOT TEST: 31 January 2011 14:37:57 PASSED

This test (358291031080) was completed on the 31 January 2011 14:37:57 and PASSED the requirements for a valid MOT with 0 comments.

This test (358291031080) was completed on the 31 January 2011 14:37:57 and PASSED the requirements for a valid MOT with 0 comments.

Recorded mileage: 36,968

Recorded mileage: 36,968


MOT TEST: 20 January 2011 10:52:26 FAILED
MOT TEST: 20 January 2011 10:52:26 FAILED

This test (156410921410) was completed on the 20 January 2011 10:52:26 and FAILED the requirements for a valid MOT with 4 comments.

This test (156410921410) was completed on the 20 January 2011 10:52:26 and FAILED the requirements for a valid MOT with 4 comments.

Recorded mileage: 36,958

Recorded mileage: 36,958


FAIL