811 UYO


811UYO is registered to a Black 1960, Morris Minor with a Petrol engine. It Failed its most recent MOT Test on the 14 February 2018

26 unique faults (34 Total) reported in its MOT History (19 Tests).

5 common/recurring faults, the most frequent (3 times) is: Offside front brake binding (3.7.B.1).

68% (13) MOT Pass Rate and a 32% (6) MOT Failure Rate.

97,117 recorded miles.

811 UYO


811UYO is registered to a Black 1960, Morris Minor with a Petrol engine. It Failed its most recent MOT Test on the 14 February 2018

26 unique faults (34 Total) reported in its MOT History (19 Tests).

5 common/recurring faults, the most frequent (3 times) is: Offside front brake binding (3.7.B.1).

68% (13) MOT Pass Rate and a 32% (6) MOT Failure Rate.

97,117 recorded miles.

MOT PASS/Failure rate for 811 UYO

all MOT test results for 811 UYO represented as a percentage
MOT PASS/Failure rate for 811 UYO
all MOT test results for 811 UYO represented as a percentage

PERCENTAGE OF VEHICLE FAULTS WITH 811 UYO

ALL REPORTED FAULTS, DISPLAYED BY PERCENTAGE OF OCCURRENCE DURING ALL MOT TESTS
PERCENTAGE OF VEHICLE FAULTS WITH 811 UYO
ALL REPORTED FAULTS, DISPLAYED BY PERCENTAGE OF OCCURRENCE DURING ALL MOT TESTS
ADVISORY

FAIL

USER ENTERED

811 UYO annual Faults by type

ALL REPORTED FAULTS, DISPLAYED over time and categorised by type
811 UYO annual Faults by type
ALL REPORTED FAULTS, DISPLAYED over time and categorised by type

RECURRING FAULTS WITH 811 UYO

FAULTS THAT HAVE OCCURED MORE THAN ONCE DURING 811 UYO's MOT HISTORY
RECURRING FAULTS WITH 811 UYO
FAULTS THAT HAVE OCCURED MORE THAN ONCE DURING 811 UYO's MOT HISTORY
Fault Fault Test Date Test Date/Time Reference MOT Test Reference
3 Offside front brake binding (3.7.b.1) Offside front brake binding (3.7.b.1) 12 February 2018 [14:59] 12/02/2018 08 July 2014 [17:59] 08/07/2014 20 June 2013 [13:29] 20/06/2013 751372877256 751372877256 287329784121 287329784121 738111873162 738111873162
2 Nearside rear shock absorber has a light misting of oil (2.7.3) Nearside rear shock absorber has a light misting of oil (2.7.3) 14 February 2018 [16:33] 14/02/2018 12 February 2018 [14:59] 12/02/2018 996844465016 996844465016 751372877256 751372877256
2 Brakes imbalanced across an axle (3.7.b.5b) Brakes imbalanced across an axle (3.7.b.5b) 20 June 2013 [13:29] 20/06/2013 12 July 2012 [11:43] 12/07/2012 738111873162 738111873162 217654492413 217654492413
2 Fuel pipes surface corrosion Fuel pipes surface corrosion 13 July 2012 [12:38] 13/07/2012 12 July 2012 [11:43] 12/07/2012 979305792120 979305792120 217654492413 217654492413
2 Slight play in offside front lower trunnion Slight play in offside front lower trunnion 24 January 2012 [15:15] 24/01/2012 26 January 2011 [14:20] 26/01/2011 525074822005 525074822005 615366921063 615366921063

ALL 811 UYO ADVISORIES [7]

ALL ADVISORIES, ORDERED by OCCURRENCE DURING 811 UYO's MOT HISTORY
ALL 811 UYO ADVISORIES [7]
ALL ADVISORIES, ORDERED by OCCURRENCE DURING 811 UYO's MOT HISTORY
Advisory Faults | source www.vehiclestats.co.uk
Fault Fault Test Date Test Date/Time Reference MOT Test Reference
2 Nearside rear shock absorber has a light misting of oil (2.7.3) Nearside rear shock absorber has a light misting of oil (2.7.3) 14 February 2018 [16:33] 14/02/2018 12 February 2018 [14:59] 12/02/2018 996844465016 996844465016 751372877256 751372877256
1 Slight oil leaks on drivetrain Slight oil leaks on drivetrain 19 February 2016 [10:05] 19/02/2016 233092147759 233092147759
1 Brakes imbalanced requirements only just met. It would appear that the braking system requires adjustment or repair. (3.7.b.5b) Brakes imbalanced requirements only just met. It would appear that the braking system requires adjustment or repair. (3.7.b.5b) 19 February 2016 [10:05] 19/02/2016 233092147759 233092147759
1 Steering system slightly rough (2.2.d.1) Steering system slightly rough (2.2.d.1) 19 February 2016 [10:05] 19/02/2016 233092147759 233092147759
1 Nearside rear suspension spring mounting prescribed area is corroded but not considered excessive (2.4.a.3) Nearside rear suspension spring mounting prescribed area is corroded but not considered excessive (2.4.a.3) 26 January 2011 [14:20] 26/01/2011 615366921063 615366921063
1 Offside rear suspension spring mounting prescribed area is corroded but not considered excessive (2.4.a.3) Offside rear suspension spring mounting prescribed area is corroded but not considered excessive (2.4.a.3) 26 January 2011 [14:20] 26/01/2011 615366921063 615366921063

ALL 811 UYO Failure Faults [21]

ALL Failure faults, ORDERED by OCCURRENCE DURING 811 UYO's MOT HISTORY
ALL 811 UYO Failure Faults [21]
ALL Failure faults, ORDERED by OCCURRENCE DURING 811 UYO's MOT HISTORY
Fail Faults | source www.vehiclestats.co.uk
Fault Fault Test Date Test Date/Time Reference MOT Test Reference
3 Offside front brake binding (3.7.b.1) Offside front brake binding (3.7.b.1) 12 February 2018 [14:59] 12/02/2018 08 July 2014 [17:59] 08/07/2014 20 June 2013 [13:29] 20/06/2013 751372877256 751372877256 287329784121 287329784121 738111873162 738111873162
2 Brakes imbalanced across an axle (3.7.b.5b) Brakes imbalanced across an axle (3.7.b.5b) 20 June 2013 [13:29] 20/06/2013 12 July 2012 [11:43] 12/07/2012 738111873162 738111873162 217654492413 217654492413
1 Direction indicators not working (1.4.a.2c) Direction indicators not working (1.4.a.2c) 12 February 2018 [14:59] 12/02/2018 751372877256 751372877256
1 Offside rear brake binding (3.7.b.1) Offside rear brake binding (3.7.b.1) 12 February 2018 [14:59] 12/02/2018 751372877256 751372877256
1 Offside rear brake recording little or no effort (3.7.b.5a) Offside rear brake recording little or no effort (3.7.b.5a) 12 February 2018 [14:59] 12/02/2018 751372877256 751372877256
1 Rear brakes imbalanced across an axle axle 2 (3.7.b.5b) Rear brakes imbalanced across an axle axle 2 (3.7.b.5b) 12 February 2018 [14:59] 12/02/2018 751372877256 751372877256
1 Offside front front brake binding (3.7.b.1) Offside front front brake binding (3.7.b.1) 07 February 2017 [16:26] 07/02/2017 516467584745 516467584745
1 Offside rear rear brake binding (3.7.b.1) Offside rear rear brake binding (3.7.b.1) 07 February 2017 [16:26] 07/02/2017 516467584745 516467584745
1 Brake performance not tested (3.7.a.1) Brake performance not tested (3.7.a.1) 07 February 2017 [16:26] 07/02/2017 516467584745 516467584745
1 Offside front direction indicator not working (1.4.a.2c) Offside front direction indicator not working (1.4.a.2c) 12 July 2012 [11:43] 12/07/2012 217654492413 217654492413
1 Nearside body or chassis has an inadequate repair, seriously affecting its strength within 30cm of the body mountings (6.1.b.2) Nearside body or chassis has an inadequate repair, seriously affecting its strength within 30cm of the body mountings (6.1.b.2) 12 July 2012 [11:43] 12/07/2012 217654492413 217654492413
1 Offside body or chassis has an inadequate repair, seriously affecting its strength within 30cm of the body mountings (6.1.b.2) Offside body or chassis has an inadequate repair, seriously affecting its strength within 30cm of the body mountings (6.1.b.2) 12 July 2012 [11:43] 12/07/2012 217654492413 217654492413
1 Offside rear body or chassis has an inadequate repair, seriously affecting its strength within 30cm of the body mountings (6.1.b.2) Offside rear body or chassis has an inadequate repair, seriously affecting its strength within 30cm of the body mountings (6.1.b.2) 12 July 2012 [11:43] 12/07/2012 217654492413 217654492413
1 Nearside front body or chassis has an inadequate repair, seriously affecting its strength within 30cm of the body mountings (6.1.b.2) Nearside front body or chassis has an inadequate repair, seriously affecting its strength within 30cm of the body mountings (6.1.b.2) 12 July 2012 [11:43] 12/07/2012 217654492413 217654492413
1 Nearside rear suspension spring mounting prescribed area is excessively corroded (2.4.a.3) Nearside rear suspension spring mounting prescribed area is excessively corroded (2.4.a.3) 24 January 2012 [15:15] 24/01/2012 525074822005 525074822005
1 Offside rear suspension spring mounting prescribed area is excessively corroded (2.4.a.3) Offside rear suspension spring mounting prescribed area is excessively corroded (2.4.a.3) 24 January 2012 [15:15] 24/01/2012 525074822005 525074822005

ALL 811 UYO User Entered Faults [6]

ALL User Entered faults, ORDERED by OCCURRENCE DURING 811 UYO's MOT HISTORY
ALL 811 UYO User Entered Faults [6]
ALL User Entered faults, ORDERED by OCCURRENCE DURING 811 UYO's MOT HISTORY
User Entered Faults | source www.vehiclestats.co.uk
Fault Fault Test Date Test Date/Time Reference MOT Test Reference
2 Fuel pipes surface corrosion Fuel pipes surface corrosion 13 July 2012 [12:38] 13/07/2012 12 July 2012 [11:43] 12/07/2012 979305792120 979305792120 217654492413 217654492413
2 Slight play in offside front lower trunnion Slight play in offside front lower trunnion 24 January 2012 [15:15] 24/01/2012 26 January 2011 [14:20] 26/01/2011 525074822005 525074822005 615366921063 615366921063
1 Play in steering rack inner joint(s) Play in steering rack inner joint(s) 08 July 2015 [09:27] 08/07/2015 146109785135 146109785135
1 Nearside inner sill corroded Nearside inner sill corroded 24 January 2012 [15:15] 24/01/2012 525074822005 525074822005

MOT TEST: 14 February 2018 16:33:57 PASSED
MOT TEST: 14 February 2018 16:33:57 PASSED

This test (996844465016) was completed on the 14 February 2018 16:33:57 and PASSED the requirements for a valid MOT with 1 comments.

This test (996844465016) was completed on the 14 February 2018 16:33:57 and PASSED the requirements for a valid MOT with 1 comments.

Recorded mileage: 97,117

Recorded mileage: 97,117


ADVISORY


MOT TEST: 12 February 2018 14:59:29 FAILED
MOT TEST: 12 February 2018 14:59:29 FAILED

This test (751372877256) was completed on the 12 February 2018 14:59:29 and FAILED the requirements for a valid MOT with 6 comments.

This test (751372877256) was completed on the 12 February 2018 14:59:29 and FAILED the requirements for a valid MOT with 6 comments.

Recorded mileage: 97,116

Recorded mileage: 97,116


ADVISORY

FAIL


MOT TEST: 08 February 2017 17:27:07 PASSED
MOT TEST: 08 February 2017 17:27:07 PASSED

This test (787681423723) was completed on the 08 February 2017 17:27:07 and PASSED the requirements for a valid MOT with 0 comments.

This test (787681423723) was completed on the 08 February 2017 17:27:07 and PASSED the requirements for a valid MOT with 0 comments.

Recorded mileage: 97,069

Recorded mileage: 97,069


MOT TEST: 07 February 2017 16:26:55 FAILED
MOT TEST: 07 February 2017 16:26:55 FAILED

This test (516467584745) was completed on the 07 February 2017 16:26:55 and FAILED the requirements for a valid MOT with 3 comments.

This test (516467584745) was completed on the 07 February 2017 16:26:55 and FAILED the requirements for a valid MOT with 3 comments.

Recorded mileage: 97,068

Recorded mileage: 97,068


FAIL


MOT TEST: 19 February 2016 10:05:56 PASSED
MOT TEST: 19 February 2016 10:05:56 PASSED

This test (233092147759) was completed on the 19 February 2016 10:05:56 and PASSED the requirements for a valid MOT with 3 comments.

This test (233092147759) was completed on the 19 February 2016 10:05:56 and PASSED the requirements for a valid MOT with 3 comments.

Recorded mileage: 96,695

Recorded mileage: 96,695


ADVISORY


MOT TEST: 08 July 2015 09:27:27 PASSED
MOT TEST: 08 July 2015 09:27:27 PASSED

This test (146109785135) was completed on the 08 July 2015 09:27:27 and PASSED the requirements for a valid MOT with 1 comments.

This test (146109785135) was completed on the 08 July 2015 09:27:27 and PASSED the requirements for a valid MOT with 1 comments.

Recorded mileage: 96,638

Recorded mileage: 96,638


USER ENTERED


MOT TEST: 10 July 2014 12:57:57 PASSED
MOT TEST: 10 July 2014 12:57:57 PASSED

This test (798631694135) was completed on the 10 July 2014 12:57:57 and PASSED the requirements for a valid MOT with 0 comments.

This test (798631694135) was completed on the 10 July 2014 12:57:57 and PASSED the requirements for a valid MOT with 0 comments.

Recorded mileage: 96,622

Recorded mileage: 96,622


MOT TEST: 08 July 2014 17:59:26 FAILED
MOT TEST: 08 July 2014 17:59:26 FAILED

This test (287329784121) was completed on the 08 July 2014 17:59:26 and FAILED the requirements for a valid MOT with 1 comments.

This test (287329784121) was completed on the 08 July 2014 17:59:26 and FAILED the requirements for a valid MOT with 1 comments.

Recorded mileage: 96,616

Recorded mileage: 96,616


FAIL


MOT TEST: 21 June 2013 11:30:39 PASSED
MOT TEST: 21 June 2013 11:30:39 PASSED

This test (375202973165) was completed on the 21 June 2013 11:30:39 and PASSED the requirements for a valid MOT with 0 comments.

This test (375202973165) was completed on the 21 June 2013 11:30:39 and PASSED the requirements for a valid MOT with 0 comments.

Recorded mileage: 96,594

Recorded mileage: 96,594


MOT TEST: 20 June 2013 13:29:56 FAILED
MOT TEST: 20 June 2013 13:29:56 FAILED

This test (738111873162) was completed on the 20 June 2013 13:29:56 and FAILED the requirements for a valid MOT with 2 comments.

This test (738111873162) was completed on the 20 June 2013 13:29:56 and FAILED the requirements for a valid MOT with 2 comments.

Recorded mileage: 96,592

Recorded mileage: 96,592


FAIL


MOT TEST: 13 July 2012 12:38:28 PASSED
MOT TEST: 13 July 2012 12:38:28 PASSED

This test (979305792120) was completed on the 13 July 2012 12:38:28 and PASSED the requirements for a valid MOT with 1 comments.

This test (979305792120) was completed on the 13 July 2012 12:38:28 and PASSED the requirements for a valid MOT with 1 comments.

Recorded mileage: 96,539

Recorded mileage: 96,539


USER ENTERED


MOT TEST: 12 July 2012 11:43:53 FAILED
MOT TEST: 12 July 2012 11:43:53 FAILED

This test (217654492413) was completed on the 12 July 2012 11:43:53 and FAILED the requirements for a valid MOT with 9 comments.

This test (217654492413) was completed on the 12 July 2012 11:43:53 and FAILED the requirements for a valid MOT with 9 comments.

Recorded mileage: 96,534

Recorded mileage: 96,534


FAIL

USER ENTERED


MOT TEST: 24 January 2012 15:15:10 FAILED
MOT TEST: 24 January 2012 15:15:10 FAILED

This test (525074822005) was completed on the 24 January 2012 15:15:10 and FAILED the requirements for a valid MOT with 4 comments.

This test (525074822005) was completed on the 24 January 2012 15:15:10 and FAILED the requirements for a valid MOT with 4 comments.

Recorded mileage: 96,522

Recorded mileage: 96,522


FAIL

USER ENTERED


MOT TEST: 26 January 2011 14:20:19 PASSED
MOT TEST: 26 January 2011 14:20:19 PASSED

This test (615366921063) was completed on the 26 January 2011 14:20:19 and PASSED the requirements for a valid MOT with 3 comments.

This test (615366921063) was completed on the 26 January 2011 14:20:19 and PASSED the requirements for a valid MOT with 3 comments.

Recorded mileage: 96,141

Recorded mileage: 96,141


ADVISORY

USER ENTERED


MOT TEST: 24 February 2010 15:07:23 PASSED
MOT TEST: 24 February 2010 15:07:23 PASSED

This test (561185950011) was completed on the 24 February 2010 15:07:23 and PASSED the requirements for a valid MOT with 0 comments.

This test (561185950011) was completed on the 24 February 2010 15:07:23 and PASSED the requirements for a valid MOT with 0 comments.

Recorded mileage: 96,019

Recorded mileage: 96,019


MOT TEST: 13 January 2009 15:10:21 PASSED
MOT TEST: 13 January 2009 15:10:21 PASSED

This test (542233319066) was completed on the 13 January 2009 15:10:21 and PASSED the requirements for a valid MOT with 0 comments.

This test (542233319066) was completed on the 13 January 2009 15:10:21 and PASSED the requirements for a valid MOT with 0 comments.

Recorded mileage: 95,794

Recorded mileage: 95,794


MOT TEST: 15 January 2008 14:46:48 PASSED
MOT TEST: 15 January 2008 14:46:48 PASSED

This test (161655518059) was completed on the 15 January 2008 14:46:48 and PASSED the requirements for a valid MOT with 0 comments.

This test (161655518059) was completed on the 15 January 2008 14:46:48 and PASSED the requirements for a valid MOT with 0 comments.

Recorded mileage: 95,628

Recorded mileage: 95,628


MOT TEST: 22 January 2007 14:39:47 PASSED
MOT TEST: 22 January 2007 14:39:47 PASSED

This test (304372927050) was completed on the 22 January 2007 14:39:47 and PASSED the requirements for a valid MOT with 0 comments.

This test (304372927050) was completed on the 22 January 2007 14:39:47 and PASSED the requirements for a valid MOT with 0 comments.

Recorded mileage: 95,303

Recorded mileage: 95,303


MOT TEST: 20 January 2006 14:07:16 PASSED
MOT TEST: 20 January 2006 14:07:16 PASSED

This test (271550526087) was completed on the 20 January 2006 14:07:16 and PASSED the requirements for a valid MOT with 0 comments.

This test (271550526087) was completed on the 20 January 2006 14:07:16 and PASSED the requirements for a valid MOT with 0 comments.

Recorded mileage: 94,689

Recorded mileage: 94,689