813 7LJ


8137LJ is registered to a Grey 1962, Morris Minor 1000 with a Petrol engine. It Passed its most recent MOT Test on the 27 February 2019

26 unique faults (34 Total) reported in its MOT History (17 Tests).

8 common/recurring faults, the most frequent (2 times) is: Rear Anti-roll bar linkage worn but not seriously weakened (2.4.G.1).

59% (10) MOT Pass Rate and a 41% (7) MOT Failure Rate.

97,641 recorded miles.

813 7LJ


8137LJ is registered to a Grey 1962, Morris Minor 1000 with a Petrol engine. It Passed its most recent MOT Test on the 27 February 2019

26 unique faults (34 Total) reported in its MOT History (17 Tests).

8 common/recurring faults, the most frequent (2 times) is: Rear Anti-roll bar linkage worn but not seriously weakened (2.4.G.1).

59% (10) MOT Pass Rate and a 41% (7) MOT Failure Rate.

97,641 recorded miles.

MOT PASS/Failure rate for 813 7LJ

all MOT test results for 813 7LJ represented as a percentage
MOT PASS/Failure rate for 813 7LJ
all MOT test results for 813 7LJ represented as a percentage

PERCENTAGE OF VEHICLE FAULTS WITH 813 7LJ

ALL REPORTED FAULTS, DISPLAYED BY PERCENTAGE OF OCCURRENCE DURING ALL MOT TESTS
PERCENTAGE OF VEHICLE FAULTS WITH 813 7LJ
ALL REPORTED FAULTS, DISPLAYED BY PERCENTAGE OF OCCURRENCE DURING ALL MOT TESTS
ADVISORY

FAIL

USER ENTERED

PASS WITH RECTIFICATION

813 7LJ annual Faults by type

ALL REPORTED FAULTS, DISPLAYED over time and categorised by type
813 7LJ annual Faults by type
ALL REPORTED FAULTS, DISPLAYED over time and categorised by type

RECURRING FAULTS WITH 813 7LJ

FAULTS THAT HAVE OCCURED MORE THAN ONCE DURING 813 7LJ's MOT HISTORY
RECURRING FAULTS WITH 813 7LJ
FAULTS THAT HAVE OCCURED MORE THAN ONCE DURING 813 7LJ's MOT HISTORY
Fault Fault Test Date Test Date/Time Reference MOT Test Reference
2 Rear anti-roll bar linkage worn but not seriously weakened (2.4.g.1) Rear anti-roll bar linkage worn but not seriously weakened (2.4.g.1) 22 February 2018 [15:17] 22/02/2018 15 February 2018 [16:47] 15/02/2018 228320268054 228320268054 687329117550 687329117550
2 Offside front wheel bearing has slight play (2.5.a.3c) Offside front wheel bearing has slight play (2.5.a.3c) 22 February 2018 [15:17] 22/02/2018 15 February 2018 [16:47] 15/02/2018 228320268054 228320268054 687329117550 687329117550
2 Oil leaks from engine gearbox and diff Oil leaks from engine gearbox and diff 22 February 2018 [15:17] 22/02/2018 15 February 2018 [16:47] 15/02/2018 228320268054 228320268054 687329117550 687329117550
2 Nearside registration plate lamp not working (1.1.c.1d) Nearside registration plate lamp not working (1.1.c.1d) 15 February 2018 [16:47] 15/02/2018 08 February 2016 [15:18] 08/02/2016 687329117550 687329117550 213224661698 213224661698
2 Nearside stop lamp not working (1.2.1b) Nearside stop lamp not working (1.2.1b) 05 February 2015 [13:49] 05/02/2015 22 February 2011 [15:12] 22/02/2011 936746135064 936746135064 977473251061 977473251061
2 Offside stop lamp not working (1.2.1b) Offside stop lamp not working (1.2.1b) 05 February 2015 [13:49] 05/02/2015 22 February 2011 [15:12] 22/02/2011 936746135064 936746135064 977473251061 977473251061
2 Windscreen washer provides insufficient washer liquid (8.2.3) Windscreen washer provides insufficient washer liquid (8.2.3) 05 February 2015 [13:49] 05/02/2015 22 January 2013 [11:01] 22/01/2013 936746135064 936746135064 696482623097 696482623097
2 Child seat fitted not allowing full inspection of adult belt Child seat fitted not allowing full inspection of adult belt 24 January 2013 [11:39] 24/01/2013 22 January 2013 [11:01] 22/01/2013 217924123032 217924123032 696482623097 696482623097

ALL 813 7LJ ADVISORIES [10]

ALL ADVISORIES, ORDERED by OCCURRENCE DURING 813 7LJ's MOT HISTORY
ALL 813 7LJ ADVISORIES [10]
ALL ADVISORIES, ORDERED by OCCURRENCE DURING 813 7LJ's MOT HISTORY
Advisory Faults | source www.vehiclestats.co.uk
Fault Fault Test Date Test Date/Time Reference MOT Test Reference
2 Rear anti-roll bar linkage worn but not seriously weakened (2.4.g.1) Rear anti-roll bar linkage worn but not seriously weakened (2.4.g.1) 22 February 2018 [15:17] 22/02/2018 15 February 2018 [16:47] 15/02/2018 228320268054 228320268054 687329117550 687329117550
2 Offside front wheel bearing has slight play (2.5.a.3c) Offside front wheel bearing has slight play (2.5.a.3c) 22 February 2018 [15:17] 22/02/2018 15 February 2018 [16:47] 15/02/2018 228320268054 228320268054 687329117550 687329117550
2 Oil leaks from engine gearbox and diff Oil leaks from engine gearbox and diff 22 February 2018 [15:17] 22/02/2018 15 February 2018 [16:47] 15/02/2018 228320268054 228320268054 687329117550 687329117550
1 Nearside rear shock absorbers light misting of oil or has limited damping effect (5.3.2 (b)) Nearside rear shock absorbers light misting of oil or has limited damping effect (5.3.2 (b)) 27 February 2019 [14:20] 27/02/2019 424848295282 424848295282
1 Offside rear shock absorber has a light misting of oil (2.7.3) Offside rear shock absorber has a light misting of oil (2.7.3) 17 February 2010 [15:35] 17/02/2010 962618140005 962618140005
1 Nearside rear brake pipe slightly corroded (3.6.b.2c) Nearside rear brake pipe slightly corroded (3.6.b.2c) 17 February 2010 [15:35] 17/02/2010 962618140005 962618140005
1 Offside rear brake pipe slightly corroded (3.6.b.2c) Offside rear brake pipe slightly corroded (3.6.b.2c) 17 February 2010 [15:35] 17/02/2010 962618140005 962618140005

ALL 813 7LJ Failure Faults [20]

ALL Failure faults, ORDERED by OCCURRENCE DURING 813 7LJ's MOT HISTORY
ALL 813 7LJ Failure Faults [20]
ALL Failure faults, ORDERED by OCCURRENCE DURING 813 7LJ's MOT HISTORY
Fail Faults | source www.vehiclestats.co.uk
Fault Fault Test Date Test Date/Time Reference MOT Test Reference
2 Nearside registration plate lamp not working (1.1.c.1d) Nearside registration plate lamp not working (1.1.c.1d) 15 February 2018 [16:47] 15/02/2018 08 February 2016 [15:18] 08/02/2016 687329117550 687329117550 213224661698 213224661698
2 Nearside stop lamp not working (1.2.1b) Nearside stop lamp not working (1.2.1b) 05 February 2015 [13:49] 05/02/2015 22 February 2011 [15:12] 22/02/2011 936746135064 936746135064 977473251061 977473251061
2 Offside stop lamp not working (1.2.1b) Offside stop lamp not working (1.2.1b) 05 February 2015 [13:49] 05/02/2015 22 February 2011 [15:12] 22/02/2011 936746135064 936746135064 977473251061 977473251061
2 Windscreen washer provides insufficient washer liquid (8.2.3) Windscreen washer provides insufficient washer liquid (8.2.3) 05 February 2015 [13:49] 05/02/2015 22 January 2013 [11:01] 22/01/2013 936746135064 936746135064 696482623097 696482623097
1 Nearside rear body or chassis has excessive corrosion, seriously affecting its strength within 30cm of the body mountings (6.1.b.2) Nearside rear body or chassis has excessive corrosion, seriously affecting its strength within 30cm of the body mountings (6.1.b.2) 15 February 2018 [16:47] 15/02/2018 687329117550 687329117550
1 Offside rear body or chassis has excessive corrosion, seriously affecting its strength within 30cm of the body mountings (6.1.b.2) Offside rear body or chassis has excessive corrosion, seriously affecting its strength within 30cm of the body mountings (6.1.b.2) 15 February 2018 [16:47] 15/02/2018 687329117550 687329117550
1 Nearside front body or chassis has excessive corrosion, seriously affecting its strength within 30cm of the body mountings (6.1.b.2) Nearside front body or chassis has excessive corrosion, seriously affecting its strength within 30cm of the body mountings (6.1.b.2) 15 February 2018 [16:47] 15/02/2018 687329117550 687329117550
1 Offside registration plate lamp not working (1.1.c.1d) Offside registration plate lamp not working (1.1.c.1d) 08 February 2016 [15:18] 08/02/2016 213224661698 213224661698
1 Front exhaust has a major leak of exhaust gases (7.1.2) Front exhaust has a major leak of exhaust gases (7.1.2) 08 February 2016 [15:18] 08/02/2016 213224661698 213224661698
1 Nearside front steering rack gaiter split (2.2.d.2d) Nearside front steering rack gaiter split (2.2.d.2d) 22 January 2013 [11:01] 22/01/2013 696482623097 696482623097
1 Nearside front vehicle structure has excessive corrosion, seriously affecting its strength within 30cm of the body mountings (6.1.b.2) Nearside front vehicle structure has excessive corrosion, seriously affecting its strength within 30cm of the body mountings (6.1.b.2) 22 January 2013 [11:01] 22/01/2013 696482623097 696482623097
1 Nearside headlamp not working on dipped beam (1.7.5a) Nearside headlamp not working on dipped beam (1.7.5a) 22 February 2011 [15:12] 22/02/2011 977473251061 977473251061
1 Nearside headlamp not working on main beam (1.7.5a) Nearside headlamp not working on main beam (1.7.5a) 22 February 2011 [15:12] 22/02/2011 977473251061 977473251061
1 Brake pedal spongy (3.3.b.1b) Brake pedal spongy (3.3.b.1b) 22 February 2011 [15:12] 22/02/2011 977473251061 977473251061
1 Nearside front mechanical brake component has restricted free movement (3.5.1k) Nearside front mechanical brake component has restricted free movement (3.5.1k) 17 February 2010 [15:35] 17/02/2010 962618140005 962618140005
1 Horn not working (1.6.2a) Horn not working (1.6.2a) 17 February 2010 [15:35] 17/02/2010 962618140005 962618140005

ALL 813 7LJ User Entered Faults [3]

ALL User Entered faults, ORDERED by OCCURRENCE DURING 813 7LJ's MOT HISTORY
ALL 813 7LJ User Entered Faults [3]
ALL User Entered faults, ORDERED by OCCURRENCE DURING 813 7LJ's MOT HISTORY
User Entered Faults | source www.vehiclestats.co.uk
Fault Fault Test Date Test Date/Time Reference MOT Test Reference
2 Child seat fitted not allowing full inspection of adult belt Child seat fitted not allowing full inspection of adult belt 24 January 2013 [11:39] 24/01/2013 22 January 2013 [11:01] 22/01/2013 217924123032 217924123032 696482623097 696482623097
1 Rear seats loaded up Rear seats loaded up 26 January 2012 [17:42] 26/01/2012 388986322063 388986322063

ALL 813 7LJ Pass With Rectification Faults [1]

ALL Pass With Rectification faults, ORDERED by OCCURRENCE DURING 813 7LJ's MOT HISTORY
ALL 813 7LJ Pass With Rectification Faults [1]
ALL Pass With Rectification faults, ORDERED by OCCURRENCE DURING 813 7LJ's MOT HISTORY
Pass With Rectification Faults | source www.vehiclestats.co.uk
Fault Fault Test Date Test Date/Time Reference MOT Test Reference
1 Nearside rear registration plate lamp not working (1.1.c.1d) Nearside rear registration plate lamp not working (1.1.c.1d) 10 February 2014 [15:05] 10/02/2014 598981644019 598981644019

MOT TEST: 27 February 2019 14:20:46 PASSED
MOT TEST: 27 February 2019 14:20:46 PASSED

This test (424848295282) was completed on the 27 February 2019 14:20:46 and PASSED the requirements for a valid MOT with 1 comments.

This test (424848295282) was completed on the 27 February 2019 14:20:46 and PASSED the requirements for a valid MOT with 1 comments.

Recorded mileage: 11,415

Recorded mileage: 11,415


ADVISORY


MOT TEST: 22 February 2018 15:17:48 PASSED
MOT TEST: 22 February 2018 15:17:48 PASSED

This test (228320268054) was completed on the 22 February 2018 15:17:48 and PASSED the requirements for a valid MOT with 3 comments.

This test (228320268054) was completed on the 22 February 2018 15:17:48 and PASSED the requirements for a valid MOT with 3 comments.

Recorded mileage: 8,975

Recorded mileage: 8,975


ADVISORY


MOT TEST: 15 February 2018 16:47:17 FAILED
MOT TEST: 15 February 2018 16:47:17 FAILED

This test (687329117550) was completed on the 15 February 2018 16:47:17 and FAILED the requirements for a valid MOT with 7 comments.

This test (687329117550) was completed on the 15 February 2018 16:47:17 and FAILED the requirements for a valid MOT with 7 comments.

Recorded mileage: 89,723

Recorded mileage: 89,723


ADVISORY

FAIL


MOT TEST: 02 March 2017 14:00:48 PASSED
MOT TEST: 02 March 2017 14:00:48 PASSED

This test (595616794196) was completed on the 02 March 2017 14:00:48 and PASSED the requirements for a valid MOT with 0 comments.

This test (595616794196) was completed on the 02 March 2017 14:00:48 and PASSED the requirements for a valid MOT with 0 comments.

Recorded mileage: 6,810

Recorded mileage: 6,810


MOT TEST: 09 February 2016 16:13:53 PASSED
MOT TEST: 09 February 2016 16:13:53 PASSED

This test (429202676057) was completed on the 09 February 2016 16:13:53 and PASSED the requirements for a valid MOT with 0 comments.

This test (429202676057) was completed on the 09 February 2016 16:13:53 and PASSED the requirements for a valid MOT with 0 comments.

Recorded mileage: 2,918

Recorded mileage: 2,918


MOT TEST: 08 February 2016 15:18:20 FAILED
MOT TEST: 08 February 2016 15:18:20 FAILED

This test (213224661698) was completed on the 08 February 2016 15:18:20 and FAILED the requirements for a valid MOT with 3 comments.

This test (213224661698) was completed on the 08 February 2016 15:18:20 and FAILED the requirements for a valid MOT with 3 comments.

Recorded mileage: 2,917

Recorded mileage: 2,917


FAIL


MOT TEST: 06 February 2015 17:15:06 PASSED
MOT TEST: 06 February 2015 17:15:06 PASSED

This test (638427735074) was completed on the 06 February 2015 17:15:06 and PASSED the requirements for a valid MOT with 0 comments.

This test (638427735074) was completed on the 06 February 2015 17:15:06 and PASSED the requirements for a valid MOT with 0 comments.

Recorded mileage: 100

Recorded mileage: 100


MOT TEST: 05 February 2015 13:49:17 FAILED
MOT TEST: 05 February 2015 13:49:17 FAILED

This test (936746135064) was completed on the 05 February 2015 13:49:17 and FAILED the requirements for a valid MOT with 3 comments.

This test (936746135064) was completed on the 05 February 2015 13:49:17 and FAILED the requirements for a valid MOT with 3 comments.

Recorded mileage: 100

Recorded mileage: 100


FAIL


MOT TEST: 10 February 2014 15:05:27 PASSED
MOT TEST: 10 February 2014 15:05:27 PASSED

This test (935601544072) was completed on the 10 February 2014 15:05:27 and PASSED the requirements for a valid MOT with 0 comments.

This test (935601544072) was completed on the 10 February 2014 15:05:27 and PASSED the requirements for a valid MOT with 0 comments.

Recorded mileage: 97,641

Recorded mileage: 97,641


MOT TEST: 10 February 2014 15:05:27 FAILED
MOT TEST: 10 February 2014 15:05:27 FAILED

This test (598981644019) was completed on the 10 February 2014 15:05:27 and FAILED the requirements for a valid MOT with 1 comments.

This test (598981644019) was completed on the 10 February 2014 15:05:27 and FAILED the requirements for a valid MOT with 1 comments.

Recorded mileage: 97,641

Recorded mileage: 97,641


PASS WITH RECTIFICATION


MOT TEST: 24 January 2013 11:39:35 PASSED
MOT TEST: 24 January 2013 11:39:35 PASSED

This test (217924123032) was completed on the 24 January 2013 11:39:35 and PASSED the requirements for a valid MOT with 1 comments.

This test (217924123032) was completed on the 24 January 2013 11:39:35 and PASSED the requirements for a valid MOT with 1 comments.

Recorded mileage: 95,042

Recorded mileage: 95,042


USER ENTERED


MOT TEST: 22 January 2013 11:01:26 FAILED
MOT TEST: 22 January 2013 11:01:26 FAILED

This test (696482623097) was completed on the 22 January 2013 11:01:26 and FAILED the requirements for a valid MOT with 4 comments.

This test (696482623097) was completed on the 22 January 2013 11:01:26 and FAILED the requirements for a valid MOT with 4 comments.

Recorded mileage: 95,042

Recorded mileage: 95,042


FAIL

USER ENTERED


MOT TEST: 26 January 2012 17:42:19 PASSED
MOT TEST: 26 January 2012 17:42:19 PASSED

This test (388986322063) was completed on the 26 January 2012 17:42:19 and PASSED the requirements for a valid MOT with 1 comments.

This test (388986322063) was completed on the 26 January 2012 17:42:19 and PASSED the requirements for a valid MOT with 1 comments.

Recorded mileage: 92,401

Recorded mileage: 92,401


USER ENTERED


MOT TEST: 23 February 2011 12:43:34 PASSED
MOT TEST: 23 February 2011 12:43:34 PASSED

This test (177094951461) was completed on the 23 February 2011 12:43:34 and PASSED the requirements for a valid MOT with 0 comments.

This test (177094951461) was completed on the 23 February 2011 12:43:34 and PASSED the requirements for a valid MOT with 0 comments.

Recorded mileage: 89,449

Recorded mileage: 89,449


MOT TEST: 22 February 2011 15:12:55 FAILED
MOT TEST: 22 February 2011 15:12:55 FAILED

This test (977473251061) was completed on the 22 February 2011 15:12:55 and FAILED the requirements for a valid MOT with 5 comments.

This test (977473251061) was completed on the 22 February 2011 15:12:55 and FAILED the requirements for a valid MOT with 5 comments.

Recorded mileage: 89,445

Recorded mileage: 89,445


FAIL


MOT TEST: 24 February 2010 16:10:18 PASSED
MOT TEST: 24 February 2010 16:10:18 PASSED

This test (124395550437) was completed on the 24 February 2010 16:10:18 and PASSED the requirements for a valid MOT with 0 comments.

This test (124395550437) was completed on the 24 February 2010 16:10:18 and PASSED the requirements for a valid MOT with 0 comments.

Recorded mileage: 85,126

Recorded mileage: 85,126


MOT TEST: 17 February 2010 15:35:53 FAILED
MOT TEST: 17 February 2010 15:35:53 FAILED

This test (962618140005) was completed on the 17 February 2010 15:35:53 and FAILED the requirements for a valid MOT with 5 comments.

This test (962618140005) was completed on the 17 February 2010 15:35:53 and FAILED the requirements for a valid MOT with 5 comments.

Recorded mileage: 85,125

Recorded mileage: 85,125


ADVISORY

FAIL