816 UYU


816UYU is registered to a Grey 1962, Morris Minor with a Petrol engine. It Failed its most recent MOT Test on the 31 January 2007

6 unique faults (6 Total) reported in its MOT History (3 Tests).

0 common/recurring faults.

67% (2) MOT Pass Rate and a 33% (1) MOT Failure Rate.

3,711 recorded miles.

816 UYU


816UYU is registered to a Grey 1962, Morris Minor with a Petrol engine. It Failed its most recent MOT Test on the 31 January 2007

6 unique faults (6 Total) reported in its MOT History (3 Tests).

0 common/recurring faults.

67% (2) MOT Pass Rate and a 33% (1) MOT Failure Rate.

3,711 recorded miles.

MOT PASS/Failure rate for 816 UYU

all MOT test results for 816 UYU represented as a percentage
MOT PASS/Failure rate for 816 UYU
all MOT test results for 816 UYU represented as a percentage

PERCENTAGE OF VEHICLE FAULTS WITH 816 UYU

ALL REPORTED FAULTS, DISPLAYED BY PERCENTAGE OF OCCURRENCE DURING ALL MOT TESTS
PERCENTAGE OF VEHICLE FAULTS WITH 816 UYU
ALL REPORTED FAULTS, DISPLAYED BY PERCENTAGE OF OCCURRENCE DURING ALL MOT TESTS
FAIL

USER ENTERED

816 UYU annual Faults by type

ALL REPORTED FAULTS, DISPLAYED over time and categorised by type
816 UYU annual Faults by type
ALL REPORTED FAULTS, DISPLAYED over time and categorised by type

ALL 816 UYU Failure Faults [4]

ALL Failure faults, ORDERED by OCCURRENCE DURING 816 UYU's MOT HISTORY
ALL 816 UYU Failure Faults [4]
ALL Failure faults, ORDERED by OCCURRENCE DURING 816 UYU's MOT HISTORY
Fail Faults | source www.vehiclestats.co.uk
Fault Fault Test Date Test Date/Time Reference MOT Test Reference
1 Nearside front track rod end ball joint has excessive play (2.2.b.1f) Nearside front track rod end ball joint has excessive play (2.2.b.1f) 16 January 2006 [08:58] 16/01/2006 202016016059 202016016059
1 Nearside rear shock absorber has a serious fluid leak (2.7.3) Nearside rear shock absorber has a serious fluid leak (2.7.3) 16 January 2006 [08:58] 16/01/2006 202016016059 202016016059
1 Nearside front vehicle structure has excessive corrosion, seriously affecting its strength within 30cm of the body mountings (6.1.b.2) Nearside front vehicle structure has excessive corrosion, seriously affecting its strength within 30cm of the body mountings (6.1.b.2) 16 January 2006 [08:58] 16/01/2006 202016016059 202016016059
1 Rear vehicle structure has excessive corrosion, seriously affecting its strength within 30cm of the body mountings (6.1.b.2) Rear vehicle structure has excessive corrosion, seriously affecting its strength within 30cm of the body mountings (6.1.b.2) 16 January 2006 [08:58] 16/01/2006 202016016059 202016016059

ALL 816 UYU User Entered Faults [2]

ALL User Entered faults, ORDERED by OCCURRENCE DURING 816 UYU's MOT HISTORY
ALL 816 UYU User Entered Faults [2]
ALL User Entered faults, ORDERED by OCCURRENCE DURING 816 UYU's MOT HISTORY
User Entered Faults | source www.vehiclestats.co.uk
Fault Fault Test Date Test Date/Time Reference MOT Test Reference
1 Wiper blades worn Wiper blades worn 31 January 2007 [15:12] 31/01/2007 624251537003 624251537003
1 Front chassis and centre floor corroding rear chassis rails starting to corrode Front chassis and centre floor corroding rear chassis rails starting to corrode 30 January 2006 [11:30] 30/01/2006 663470236069 663470236069

MOT TEST: 31 January 2007 15:12:34 PASSED
MOT TEST: 31 January 2007 15:12:34 PASSED

This test (624251537003) was completed on the 31 January 2007 15:12:34 and PASSED the requirements for a valid MOT with 1 comments.

This test (624251537003) was completed on the 31 January 2007 15:12:34 and PASSED the requirements for a valid MOT with 1 comments.

Recorded mileage: 3,711

Recorded mileage: 3,711


USER ENTERED


MOT TEST: 30 January 2006 11:30:57 PASSED
MOT TEST: 30 January 2006 11:30:57 PASSED

This test (663470236069) was completed on the 30 January 2006 11:30:57 and PASSED the requirements for a valid MOT with 1 comments.

This test (663470236069) was completed on the 30 January 2006 11:30:57 and PASSED the requirements for a valid MOT with 1 comments.

Recorded mileage: 3,711

Recorded mileage: 3,711


USER ENTERED


MOT TEST: 16 January 2006 08:58:32 FAILED
MOT TEST: 16 January 2006 08:58:32 FAILED

This test (202016016059) was completed on the 16 January 2006 08:58:32 and FAILED the requirements for a valid MOT with 4 comments.

This test (202016016059) was completed on the 16 January 2006 08:58:32 and FAILED the requirements for a valid MOT with 4 comments.

Recorded mileage: 3,711

Recorded mileage: 3,711


FAIL