819 RWC


819RWC is registered to a Grey 1963, Morris Minor traveller with a Petrol engine. It Failed its most recent MOT Test on the 14 May 2018

5 unique faults (5 Total) reported in its MOT History (8 Tests).

0 common/recurring faults.

75% (6) MOT Pass Rate and a 25% (2) MOT Failure Rate.

36,698 recorded miles.

819 RWC


819RWC is registered to a Grey 1963, Morris Minor traveller with a Petrol engine. It Failed its most recent MOT Test on the 14 May 2018

5 unique faults (5 Total) reported in its MOT History (8 Tests).

0 common/recurring faults.

75% (6) MOT Pass Rate and a 25% (2) MOT Failure Rate.

36,698 recorded miles.

MOT PASS/Failure rate for 819 RWC

all MOT test results for 819 RWC represented as a percentage
MOT PASS/Failure rate for 819 RWC
all MOT test results for 819 RWC represented as a percentage

PERCENTAGE OF VEHICLE FAULTS WITH 819 RWC

ALL REPORTED FAULTS, DISPLAYED BY PERCENTAGE OF OCCURRENCE DURING ALL MOT TESTS
PERCENTAGE OF VEHICLE FAULTS WITH 819 RWC
ALL REPORTED FAULTS, DISPLAYED BY PERCENTAGE OF OCCURRENCE DURING ALL MOT TESTS
FAIL

PASS WITH RECTIFICATION

819 RWC annual Faults by type

ALL REPORTED FAULTS, DISPLAYED over time and categorised by type
819 RWC annual Faults by type
ALL REPORTED FAULTS, DISPLAYED over time and categorised by type

ALL 819 RWC Failure Faults [4]

ALL Failure faults, ORDERED by OCCURRENCE DURING 819 RWC's MOT HISTORY
ALL 819 RWC Failure Faults [4]
ALL Failure faults, ORDERED by OCCURRENCE DURING 819 RWC's MOT HISTORY
Fail Faults | source www.vehiclestats.co.uk
Fault Fault Test Date Test Date/Time Reference MOT Test Reference
1 Offside front brake hose bulging under pressure (3.6.b.3) Offside front brake hose bulging under pressure (3.6.b.3) 29 April 2015 [17:08] 29/04/2015 459779415191 459779415191
1 Nearside front front brake recording little or no effort (3.7.b.5a) Nearside front front brake recording little or no effort (3.7.b.5a) 29 April 2015 [17:08] 29/04/2015 459779415191 459779415191
1 Service brake: efficiency below requirements (3.7.b.7) Service brake: efficiency below requirements (3.7.b.7) 29 April 2015 [17:08] 29/04/2015 459779415191 459779415191
1 Brakes imbalanced across an axle (3.7.b.5b) Brakes imbalanced across an axle (3.7.b.5b) 29 April 2015 [17:08] 29/04/2015 459779415191 459779415191

ALL 819 RWC Pass With Rectification Faults [1]

ALL Pass With Rectification faults, ORDERED by OCCURRENCE DURING 819 RWC's MOT HISTORY
ALL 819 RWC Pass With Rectification Faults [1]
ALL Pass With Rectification faults, ORDERED by OCCURRENCE DURING 819 RWC's MOT HISTORY
Pass With Rectification Faults | source www.vehiclestats.co.uk
Fault Fault Test Date Test Date/Time Reference MOT Test Reference
1 Nearside headlamp insecure (1.7.3) Nearside headlamp insecure (1.7.3) 11 May 2017 [12:06] 11/05/2017 932003739435 932003739435

MOT TEST: 14 May 2018 09:54:07 PASSED
MOT TEST: 14 May 2018 09:54:07 PASSED

This test (745652241145) was completed on the 14 May 2018 09:54:07 and PASSED the requirements for a valid MOT with 0 comments.

This test (745652241145) was completed on the 14 May 2018 09:54:07 and PASSED the requirements for a valid MOT with 0 comments.

Recorded mileage: 36,698

Recorded mileage: 36,698


MOT TEST: 11 May 2017 12:06:48 PASSED
MOT TEST: 11 May 2017 12:06:48 PASSED

This test (623062600557) was completed on the 11 May 2017 12:06:48 and PASSED the requirements for a valid MOT with 0 comments.

This test (623062600557) was completed on the 11 May 2017 12:06:48 and PASSED the requirements for a valid MOT with 0 comments.

Recorded mileage: 36,670

Recorded mileage: 36,670


MOT TEST: 11 May 2017 12:06:47 FAILED
MOT TEST: 11 May 2017 12:06:47 FAILED

This test (932003739435) was completed on the 11 May 2017 12:06:47 and FAILED the requirements for a valid MOT with 1 comments.

This test (932003739435) was completed on the 11 May 2017 12:06:47 and FAILED the requirements for a valid MOT with 1 comments.

Recorded mileage: 36,670

Recorded mileage: 36,670


PASS WITH RECTIFICATION


MOT TEST: 12 May 2016 11:37:45 PASSED
MOT TEST: 12 May 2016 11:37:45 PASSED

This test (187248956903) was completed on the 12 May 2016 11:37:45 and PASSED the requirements for a valid MOT with 0 comments.

This test (187248956903) was completed on the 12 May 2016 11:37:45 and PASSED the requirements for a valid MOT with 0 comments.

Recorded mileage: 36,647

Recorded mileage: 36,647


MOT TEST: 30 April 2015 16:39:01 PASSED
MOT TEST: 30 April 2015 16:39:01 PASSED

This test (695810425196) was completed on the 30 April 2015 16:39:01 and PASSED the requirements for a valid MOT with 0 comments.

This test (695810425196) was completed on the 30 April 2015 16:39:01 and PASSED the requirements for a valid MOT with 0 comments.

Recorded mileage: 36,598

Recorded mileage: 36,598


MOT TEST: 29 April 2015 17:08:14 FAILED
MOT TEST: 29 April 2015 17:08:14 FAILED

This test (459779415191) was completed on the 29 April 2015 17:08:14 and FAILED the requirements for a valid MOT with 4 comments.

This test (459779415191) was completed on the 29 April 2015 17:08:14 and FAILED the requirements for a valid MOT with 4 comments.

Recorded mileage: 36,598

Recorded mileage: 36,598


FAIL


MOT TEST: 28 August 2007 11:55:44 PASSED
MOT TEST: 28 August 2007 11:55:44 PASSED

This test (901990247227) was completed on the 28 August 2007 11:55:44 and PASSED the requirements for a valid MOT with 0 comments.

This test (901990247227) was completed on the 28 August 2007 11:55:44 and PASSED the requirements for a valid MOT with 0 comments.

Recorded mileage: 36,560

Recorded mileage: 36,560


MOT TEST: 11 August 2006 15:21:59 PASSED
MOT TEST: 11 August 2006 15:21:59 PASSED

This test (991023626211) was completed on the 11 August 2006 15:21:59 and PASSED the requirements for a valid MOT with 0 comments.

This test (991023626211) was completed on the 11 August 2006 15:21:59 and PASSED the requirements for a valid MOT with 0 comments.

Recorded mileage: 36,393

Recorded mileage: 36,393