823 XUE


823XUE is registered to a Grey 1962, Morris Minor 1000 with a Petrol engine. It Failed its most recent MOT Test on the 03 April 2007

8 unique faults (8 Total) reported in its MOT History (2 Tests).

0 common/recurring faults.

50% (1) MOT Pass Rate and a 50% (1) MOT Failure Rate.

66,360 recorded miles.

823 XUE


823XUE is registered to a Grey 1962, Morris Minor 1000 with a Petrol engine. It Failed its most recent MOT Test on the 03 April 2007

8 unique faults (8 Total) reported in its MOT History (2 Tests).

0 common/recurring faults.

50% (1) MOT Pass Rate and a 50% (1) MOT Failure Rate.

66,360 recorded miles.

MOT PASS/Failure rate for 823 XUE

all MOT test results for 823 XUE represented as a percentage
MOT PASS/Failure rate for 823 XUE
all MOT test results for 823 XUE represented as a percentage

PERCENTAGE OF VEHICLE FAULTS WITH 823 XUE

ALL REPORTED FAULTS, DISPLAYED BY PERCENTAGE OF OCCURRENCE DURING ALL MOT TESTS
PERCENTAGE OF VEHICLE FAULTS WITH 823 XUE
ALL REPORTED FAULTS, DISPLAYED BY PERCENTAGE OF OCCURRENCE DURING ALL MOT TESTS
FAIL

823 XUE annual Faults by type

ALL REPORTED FAULTS, DISPLAYED over time and categorised by type
823 XUE annual Faults by type
ALL REPORTED FAULTS, DISPLAYED over time and categorised by type

ALL 823 XUE Failure Faults [8]

ALL Failure faults, ORDERED by OCCURRENCE DURING 823 XUE's MOT HISTORY
ALL 823 XUE Failure Faults [8]
ALL Failure faults, ORDERED by OCCURRENCE DURING 823 XUE's MOT HISTORY
Fail Faults | source www.vehiclestats.co.uk
Fault Fault Test Date Test Date/Time Reference MOT Test Reference
1 Windscreen washer provides insufficient washer liquid (8.2.3) Windscreen washer provides insufficient washer liquid (8.2.3) 22 March 2007 [15:26] 22/03/2007 822131787027 822131787027
1 Nearside front suspension component mounting prescribed area is excessively corroded (2.4.a.3) Nearside front suspension component mounting prescribed area is excessively corroded (2.4.a.3) 22 March 2007 [15:26] 22/03/2007 822131787027 822131787027
1 Offside front suspension component mounting prescribed area is excessively corroded (2.4.a.3) Offside front suspension component mounting prescribed area is excessively corroded (2.4.a.3) 22 March 2007 [15:26] 22/03/2007 822131787027 822131787027
1 Nearside suspension component mounting prescribed area is excessively corroded (2.4.a.3) Nearside suspension component mounting prescribed area is excessively corroded (2.4.a.3) 22 March 2007 [15:26] 22/03/2007 822131787027 822131787027
1 Nearside front headlamp not in good working order adversely affecting beam image (1.2.4a) Nearside front headlamp not in good working order adversely affecting beam image (1.2.4a) 22 March 2007 [15:26] 22/03/2007 822131787027 822131787027
1 Offside front headlamp not in good working order adversely affecting beam image (1.2.4a) Offside front headlamp not in good working order adversely affecting beam image (1.2.4a) 22 March 2007 [15:26] 22/03/2007 822131787027 822131787027
1 Parking brake: efficiency below requirements (3.7.b.7) Parking brake: efficiency below requirements (3.7.b.7) 22 March 2007 [15:26] 22/03/2007 822131787027 822131787027
1 Brakes imbalanced across an axle (3.7.b.5b) Brakes imbalanced across an axle (3.7.b.5b) 22 March 2007 [15:26] 22/03/2007 822131787027 822131787027

MOT TEST: 03 April 2007 14:53:34 PASSED
MOT TEST: 03 April 2007 14:53:34 PASSED

This test (182193297480) was completed on the 03 April 2007 14:53:34 and PASSED the requirements for a valid MOT with 0 comments.

This test (182193297480) was completed on the 03 April 2007 14:53:34 and PASSED the requirements for a valid MOT with 0 comments.

Recorded mileage: 66,360

Recorded mileage: 66,360


MOT TEST: 22 March 2007 15:26:55 FAILED
MOT TEST: 22 March 2007 15:26:55 FAILED

This test (822131787027) was completed on the 22 March 2007 15:26:55 and FAILED the requirements for a valid MOT with 8 comments.

This test (822131787027) was completed on the 22 March 2007 15:26:55 and FAILED the requirements for a valid MOT with 8 comments.

Recorded mileage: 66,347

Recorded mileage: 66,347


FAIL