827 GOX


827GOX is registered to a Grey 1962, Morris Mini 850 van with a Petrol engine. It Passed its most recent MOT Test on the 10 March 2019

8 unique faults (10 Total) reported in its MOT History (16 Tests).

2 common/recurring faults, the most frequent (2 times) is: Offside Windscreen wiper does not clear the windscreen effectively (8.2.2).

69% (11) MOT Pass Rate and a 31% (5) MOT Failure Rate.

52,699 recorded miles.

827 GOX


827GOX is registered to a Grey 1962, Morris Mini 850 van with a Petrol engine. It Passed its most recent MOT Test on the 10 March 2019

8 unique faults (10 Total) reported in its MOT History (16 Tests).

2 common/recurring faults, the most frequent (2 times) is: Offside Windscreen wiper does not clear the windscreen effectively (8.2.2).

69% (11) MOT Pass Rate and a 31% (5) MOT Failure Rate.

52,699 recorded miles.

MOT PASS/Failure rate for 827 GOX

all MOT test results for 827 GOX represented as a percentage
MOT PASS/Failure rate for 827 GOX
all MOT test results for 827 GOX represented as a percentage

PERCENTAGE OF VEHICLE FAULTS WITH 827 GOX

ALL REPORTED FAULTS, DISPLAYED BY PERCENTAGE OF OCCURRENCE DURING ALL MOT TESTS
PERCENTAGE OF VEHICLE FAULTS WITH 827 GOX
ALL REPORTED FAULTS, DISPLAYED BY PERCENTAGE OF OCCURRENCE DURING ALL MOT TESTS
PASS WITH RECTIFICATION

827 GOX annual Faults by type

ALL REPORTED FAULTS, DISPLAYED over time and categorised by type
827 GOX annual Faults by type
ALL REPORTED FAULTS, DISPLAYED over time and categorised by type

RECURRING FAULTS WITH 827 GOX

FAULTS THAT HAVE OCCURED MORE THAN ONCE DURING 827 GOX's MOT HISTORY
RECURRING FAULTS WITH 827 GOX
FAULTS THAT HAVE OCCURED MORE THAN ONCE DURING 827 GOX's MOT HISTORY
Fault Fault Test Date Test Date/Time Reference MOT Test Reference
2 Offside windscreen wiper does not clear the windscreen effectively (8.2.2) Offside windscreen wiper does not clear the windscreen effectively (8.2.2) 06 March 2018 [07:35] 06/03/2018 03 April 2017 [08:01] 03/04/2017 467501513538 467501513538 583706830200 583706830200
2 Nearside registration plate lamp not working (1.1.c.1d) Nearside registration plate lamp not working (1.1.c.1d) 06 March 2018 [07:35] 06/03/2018 30 March 2013 [08:56] 30/03/2013 467501513538 467501513538 616999983013 616999983013

ALL 827 GOX Pass With Rectification Faults [10]

ALL Pass With Rectification faults, ORDERED by OCCURRENCE DURING 827 GOX's MOT HISTORY
ALL 827 GOX Pass With Rectification Faults [10]
ALL Pass With Rectification faults, ORDERED by OCCURRENCE DURING 827 GOX's MOT HISTORY
Pass With Rectification Faults | source www.vehiclestats.co.uk
Fault Fault Test Date Test Date/Time Reference MOT Test Reference
2 Offside windscreen wiper does not clear the windscreen effectively (8.2.2) Offside windscreen wiper does not clear the windscreen effectively (8.2.2) 06 March 2018 [07:35] 06/03/2018 03 April 2017 [08:01] 03/04/2017 467501513538 467501513538 583706830200 583706830200
2 Nearside registration plate lamp not working (1.1.c.1d) Nearside registration plate lamp not working (1.1.c.1d) 06 March 2018 [07:35] 06/03/2018 30 March 2013 [08:56] 30/03/2013 467501513538 467501513538 616999983013 616999983013
1 Nearside rear registration plate lamp inoperative in the case of a single lamp or all lamps (4.7.1 (b) (ii)) Nearside rear registration plate lamp inoperative in the case of a single lamp or all lamps (4.7.1 (b) (ii)) 10 March 2019 [10:53] 10/03/2019 345622088635 345622088635
1 Nearside rear service brake efficiency less than 50% of the required value (1.2.2 (a) (ii)) Nearside rear service brake efficiency less than 50% of the required value (1.2.2 (a) (ii)) 10 March 2019 [10:53] 10/03/2019 345622088635 345622088635
1 Offside front constant velocity joint gaiter insecure to the extent that it no longer prevents the ingress of dirt etc (2.5.c.1a) Offside front constant velocity joint gaiter insecure to the extent that it no longer prevents the ingress of dirt etc (2.5.c.1a) 06 March 2018 [07:35] 06/03/2018 467501513538 467501513538
1 Stop lamp not working (1.2.1b) Stop lamp not working (1.2.1b) 03 April 2017 [08:01] 03/04/2017 583706830200 583706830200
1 Nearside stop lamp not working (1.2.1b) Nearside stop lamp not working (1.2.1b) 22 March 2016 [17:17] 22/03/2016 374273573984 374273573984
1 Offside stop lamp not working (1.2.1b) Offside stop lamp not working (1.2.1b) 30 March 2013 [08:56] 30/03/2013 616999983013 616999983013

MOT TEST: 10 March 2019 10:53:19 PASSED
MOT TEST: 10 March 2019 10:53:19 PASSED

This test (354348583230) was completed on the 10 March 2019 10:53:19 and PASSED the requirements for a valid MOT with 0 comments.

This test (354348583230) was completed on the 10 March 2019 10:53:19 and PASSED the requirements for a valid MOT with 0 comments.

Recorded mileage: 52,692

Recorded mileage: 52,692


MOT TEST: 10 March 2019 10:53:18 FAILED
MOT TEST: 10 March 2019 10:53:18 FAILED

This test (345622088635) was completed on the 10 March 2019 10:53:18 and FAILED the requirements for a valid MOT with 2 comments.

This test (345622088635) was completed on the 10 March 2019 10:53:18 and FAILED the requirements for a valid MOT with 2 comments.

Recorded mileage: 52,692

Recorded mileage: 52,692


PASS WITH RECTIFICATION


MOT TEST: 06 March 2018 07:35:29 PASSED
MOT TEST: 06 March 2018 07:35:29 PASSED

This test (416955180115) was completed on the 06 March 2018 07:35:29 and PASSED the requirements for a valid MOT with 0 comments.

This test (416955180115) was completed on the 06 March 2018 07:35:29 and PASSED the requirements for a valid MOT with 0 comments.

Recorded mileage: 52,699

Recorded mileage: 52,699


MOT TEST: 06 March 2018 07:35:28 FAILED
MOT TEST: 06 March 2018 07:35:28 FAILED

This test (467501513538) was completed on the 06 March 2018 07:35:28 and FAILED the requirements for a valid MOT with 3 comments.

This test (467501513538) was completed on the 06 March 2018 07:35:28 and FAILED the requirements for a valid MOT with 3 comments.

Recorded mileage: 52,699

Recorded mileage: 52,699


PASS WITH RECTIFICATION


MOT TEST: 03 April 2017 08:01:51 PASSED
MOT TEST: 03 April 2017 08:01:51 PASSED

This test (157590375073) was completed on the 03 April 2017 08:01:51 and PASSED the requirements for a valid MOT with 0 comments.

This test (157590375073) was completed on the 03 April 2017 08:01:51 and PASSED the requirements for a valid MOT with 0 comments.

Recorded mileage: 52,659

Recorded mileage: 52,659


MOT TEST: 03 April 2017 08:01:50 FAILED
MOT TEST: 03 April 2017 08:01:50 FAILED

This test (583706830200) was completed on the 03 April 2017 08:01:50 and FAILED the requirements for a valid MOT with 2 comments.

This test (583706830200) was completed on the 03 April 2017 08:01:50 and FAILED the requirements for a valid MOT with 2 comments.

Recorded mileage: 52,659

Recorded mileage: 52,659


PASS WITH RECTIFICATION


MOT TEST: 22 March 2016 17:17:57 PASSED
MOT TEST: 22 March 2016 17:17:57 PASSED

This test (756594063865) was completed on the 22 March 2016 17:17:57 and PASSED the requirements for a valid MOT with 0 comments.

This test (756594063865) was completed on the 22 March 2016 17:17:57 and PASSED the requirements for a valid MOT with 0 comments.

Recorded mileage: 52,576

Recorded mileage: 52,576


MOT TEST: 22 March 2016 17:17:56 FAILED
MOT TEST: 22 March 2016 17:17:56 FAILED

This test (374273573984) was completed on the 22 March 2016 17:17:56 and FAILED the requirements for a valid MOT with 1 comments.

This test (374273573984) was completed on the 22 March 2016 17:17:56 and FAILED the requirements for a valid MOT with 1 comments.

Recorded mileage: 52,576

Recorded mileage: 52,576


PASS WITH RECTIFICATION


MOT TEST: 05 March 2015 17:01:37 PASSED
MOT TEST: 05 March 2015 17:01:37 PASSED

This test (996764165007) was completed on the 05 March 2015 17:01:37 and PASSED the requirements for a valid MOT with 0 comments.

This test (996764165007) was completed on the 05 March 2015 17:01:37 and PASSED the requirements for a valid MOT with 0 comments.

Recorded mileage: 52,565

Recorded mileage: 52,565


MOT TEST: 06 March 2014 10:48:45 PASSED
MOT TEST: 06 March 2014 10:48:45 PASSED

This test (936755464065) was completed on the 06 March 2014 10:48:45 and PASSED the requirements for a valid MOT with 0 comments.

This test (936755464065) was completed on the 06 March 2014 10:48:45 and PASSED the requirements for a valid MOT with 0 comments.

Recorded mileage: 52,540

Recorded mileage: 52,540


MOT TEST: 30 March 2013 08:56:23 PASSED
MOT TEST: 30 March 2013 08:56:23 PASSED

This test (197909883093) was completed on the 30 March 2013 08:56:23 and PASSED the requirements for a valid MOT with 0 comments.

This test (197909883093) was completed on the 30 March 2013 08:56:23 and PASSED the requirements for a valid MOT with 0 comments.

Recorded mileage: 52,435

Recorded mileage: 52,435


MOT TEST: 30 March 2013 08:56:23 FAILED
MOT TEST: 30 March 2013 08:56:23 FAILED

This test (616999983013) was completed on the 30 March 2013 08:56:23 and FAILED the requirements for a valid MOT with 2 comments.

This test (616999983013) was completed on the 30 March 2013 08:56:23 and FAILED the requirements for a valid MOT with 2 comments.

Recorded mileage: 52,435

Recorded mileage: 52,435


PASS WITH RECTIFICATION


MOT TEST: 24 March 2012 12:06:02 PASSED
MOT TEST: 24 March 2012 12:06:02 PASSED

This test (736024382056) was completed on the 24 March 2012 12:06:02 and PASSED the requirements for a valid MOT with 0 comments.

This test (736024382056) was completed on the 24 March 2012 12:06:02 and PASSED the requirements for a valid MOT with 0 comments.

Recorded mileage: 52,410

Recorded mileage: 52,410


MOT TEST: 29 March 2011 17:23:18 PASSED
MOT TEST: 29 March 2011 17:23:18 PASSED

This test (899008581084) was completed on the 29 March 2011 17:23:18 and PASSED the requirements for a valid MOT with 0 comments.

This test (899008581084) was completed on the 29 March 2011 17:23:18 and PASSED the requirements for a valid MOT with 0 comments.

Recorded mileage: 52,364

Recorded mileage: 52,364


MOT TEST: 11 March 2010 16:38:04 PASSED
MOT TEST: 11 March 2010 16:38:04 PASSED

This test (120350670060) was completed on the 11 March 2010 16:38:04 and PASSED the requirements for a valid MOT with 0 comments.

This test (120350670060) was completed on the 11 March 2010 16:38:04 and PASSED the requirements for a valid MOT with 0 comments.

Recorded mileage: 52,287

Recorded mileage: 52,287


MOT TEST: 21 March 2009 12:02:25 PASSED
MOT TEST: 21 March 2009 12:02:25 PASSED

This test (983060389031) was completed on the 21 March 2009 12:02:25 and PASSED the requirements for a valid MOT with 0 comments.

This test (983060389031) was completed on the 21 March 2009 12:02:25 and PASSED the requirements for a valid MOT with 0 comments.

Recorded mileage: 52,127

Recorded mileage: 52,127