827 UXY


827UXY is registered to a Black 1961, Morris Minor with a Petrol engine. It Failed its most recent MOT Test on the 06 October 2017

56 unique faults (75 Total) reported in its MOT History (20 Tests).

9 common/recurring faults, the most frequent (5 times) is: Service brake: efficiency below requirements (3.7.B.7).

50% (10) MOT Pass Rate and a 50% (10) MOT Failure Rate.

47,054 recorded miles.

827 UXY


827UXY is registered to a Black 1961, Morris Minor with a Petrol engine. It Failed its most recent MOT Test on the 06 October 2017

56 unique faults (75 Total) reported in its MOT History (20 Tests).

9 common/recurring faults, the most frequent (5 times) is: Service brake: efficiency below requirements (3.7.B.7).

50% (10) MOT Pass Rate and a 50% (10) MOT Failure Rate.

47,054 recorded miles.

MOT PASS/Failure rate for 827 UXY

all MOT test results for 827 UXY represented as a percentage
MOT PASS/Failure rate for 827 UXY
all MOT test results for 827 UXY represented as a percentage

PERCENTAGE OF VEHICLE FAULTS WITH 827 UXY

ALL REPORTED FAULTS, DISPLAYED BY PERCENTAGE OF OCCURRENCE DURING ALL MOT TESTS
PERCENTAGE OF VEHICLE FAULTS WITH 827 UXY
ALL REPORTED FAULTS, DISPLAYED BY PERCENTAGE OF OCCURRENCE DURING ALL MOT TESTS
ADVISORY

FAIL

PASS WITH RECTIFICATION

827 UXY annual Faults by type

ALL REPORTED FAULTS, DISPLAYED over time and categorised by type
827 UXY annual Faults by type
ALL REPORTED FAULTS, DISPLAYED over time and categorised by type

RECURRING FAULTS WITH 827 UXY

FAULTS THAT HAVE OCCURED MORE THAN ONCE DURING 827 UXY's MOT HISTORY
RECURRING FAULTS WITH 827 UXY
FAULTS THAT HAVE OCCURED MORE THAN ONCE DURING 827 UXY's MOT HISTORY
Fault Fault Test Date Test Date/Time Reference MOT Test Reference
5 Service brake: efficiency below requirements (3.7.b.7) Service brake: efficiency below requirements (3.7.b.7) 14 August 2017 [13:51] 14/08/2017 09 June 2014 [13:13] 09/06/2014 23 May 2013 [12:32] 23/05/2013 01 March 2012 [15:53] 01/03/2012 04 June 2008 [13:55] 04/06/2008 199404547427 199404547427 326710664135 326710664135 947263143148 947263143148 105251962018 105251962018 961226058111 961226058111
5 Parking brake: efficiency below requirements (3.7.b.7) Parking brake: efficiency below requirements (3.7.b.7) 14 August 2017 [13:51] 14/08/2017 12 August 2015 [13:34] 12/08/2015 09 June 2014 [13:13] 09/06/2014 23 May 2013 [12:32] 23/05/2013 01 March 2012 [15:53] 01/03/2012 199404547427 199404547427 537424025259 537424025259 326710664135 326710664135 947263143148 947263143148 105251962018 105251962018
3 Nearside front vehicle structure has excessive corrosion, seriously affecting its strength within 30cm of the body mountings (6.1.b.2) Nearside front vehicle structure has excessive corrosion, seriously affecting its strength within 30cm of the body mountings (6.1.b.2) 04 October 2017 [11:42] 04/10/2017 14 August 2017 [13:51] 14/08/2017 22 July 2016 [14:09] 22/07/2016 478391401672 478391401672 199404547427 199404547427 344483998648 344483998648
3 Offside rear brake recording little or no effort (3.7.b.5a) Offside rear brake recording little or no effort (3.7.b.5a) 04 October 2017 [11:42] 04/10/2017 09 June 2014 [13:13] 09/06/2014 23 May 2013 [12:32] 23/05/2013 478391401672 478391401672 326710664135 326710664135 947263143148 947263143148
3 Nearside rear brake recording little or no effort (3.7.b.5a) Nearside rear brake recording little or no effort (3.7.b.5a) 09 June 2014 [13:13] 09/06/2014 23 May 2013 [12:32] 23/05/2013 01 March 2012 [15:53] 01/03/2012 326710664135 326710664135 947263143148 947263143148 105251962018 105251962018
3 Nearside rear parking brake recording little or no effort (3.7.b.6a) Nearside rear parking brake recording little or no effort (3.7.b.6a) 09 June 2014 [13:13] 09/06/2014 23 May 2013 [12:32] 23/05/2013 01 March 2012 [15:53] 01/03/2012 326710664135 326710664135 947263143148 947263143148 105251962018 105251962018
2 Offside inner body or chassis has excessive corrosion, seriously affecting its strength within 30cm of the body mountings (6.1.b.2) Offside inner body or chassis has excessive corrosion, seriously affecting its strength within 30cm of the body mountings (6.1.b.2) 12 August 2015 [13:34] 12/08/2015 09 June 2014 [13:13] 09/06/2014 537424025259 537424025259 326710664135 326710664135
2 Offside rear braking system leaking (3.6.a.1) Offside rear braking system leaking (3.6.a.1) 09 June 2014 [13:13] 09/06/2014 01 March 2012 [15:53] 01/03/2012 326710664135 326710664135 105251962018 105251962018
2 Offside rear parking brake recording little or no effort (3.7.b.6a) Offside rear parking brake recording little or no effort (3.7.b.6a) 09 June 2014 [13:13] 09/06/2014 23 May 2013 [12:32] 23/05/2013 326710664135 326710664135 947263143148 947263143148

ALL 827 UXY ADVISORIES [6]

ALL ADVISORIES, ORDERED by OCCURRENCE DURING 827 UXY's MOT HISTORY
ALL 827 UXY ADVISORIES [6]
ALL ADVISORIES, ORDERED by OCCURRENCE DURING 827 UXY's MOT HISTORY
Fail Faults | source www.vehiclestats.co.uk
Fault Fault Test Date Test Date/Time Reference MOT Test Reference
1 Offside front outer body has slight corrosion (6.1.b.2) Offside front outer body has slight corrosion (6.1.b.2) 14 August 2017 [13:51] 14/08/2017 199404547427 199404547427
1 Nearside rear shock absorber has a light misting of oil (2.7.3) Nearside rear shock absorber has a light misting of oil (2.7.3) 14 August 2017 [13:51] 14/08/2017 199404547427 199404547427
1 Clutch pedal operates brake pedal and brake pedal partially operates clutch Clutch pedal operates brake pedal and brake pedal partially operates clutch 14 August 2017 [13:51] 14/08/2017 199404547427 199404547427
1 Offside front wheel bearing has slight play (2.5.a.3c) Offside front wheel bearing has slight play (2.5.a.3c) 12 August 2015 [13:34] 12/08/2015 537424025259 537424025259
1 Nearside front track rod end ball joint has slight play (2.2.b.1f) Nearside front track rod end ball joint has slight play (2.2.b.1f) 23 May 2013 [12:32] 23/05/2013 947263143148 947263143148
1 Nearside front tyre worn close to the legal limit (4.1.e.1) Nearside front tyre worn close to the legal limit (4.1.e.1) 23 May 2013 [12:32] 23/05/2013 947263143148 947263143148

ALL 827 UXY Failure Faults [67]

ALL Failure faults, ORDERED by OCCURRENCE DURING 827 UXY's MOT HISTORY
ALL 827 UXY Failure Faults [67]
ALL Failure faults, ORDERED by OCCURRENCE DURING 827 UXY's MOT HISTORY
Fail Faults | source www.vehiclestats.co.uk
Fault Fault Test Date Test Date/Time Reference MOT Test Reference
5 Service brake: efficiency below requirements (3.7.b.7) Service brake: efficiency below requirements (3.7.b.7) 14 August 2017 [13:51] 14/08/2017 09 June 2014 [13:13] 09/06/2014 23 May 2013 [12:32] 23/05/2013 01 March 2012 [15:53] 01/03/2012 04 June 2008 [13:55] 04/06/2008 199404547427 199404547427 326710664135 326710664135 947263143148 947263143148 105251962018 105251962018 961226058111 961226058111
5 Parking brake: efficiency below requirements (3.7.b.7) Parking brake: efficiency below requirements (3.7.b.7) 14 August 2017 [13:51] 14/08/2017 12 August 2015 [13:34] 12/08/2015 09 June 2014 [13:13] 09/06/2014 23 May 2013 [12:32] 23/05/2013 01 March 2012 [15:53] 01/03/2012 199404547427 199404547427 537424025259 537424025259 326710664135 326710664135 947263143148 947263143148 105251962018 105251962018
3 Nearside front vehicle structure has excessive corrosion, seriously affecting its strength within 30cm of the body mountings (6.1.b.2) Nearside front vehicle structure has excessive corrosion, seriously affecting its strength within 30cm of the body mountings (6.1.b.2) 04 October 2017 [11:42] 04/10/2017 14 August 2017 [13:51] 14/08/2017 22 July 2016 [14:09] 22/07/2016 478391401672 478391401672 199404547427 199404547427 344483998648 344483998648
3 Offside rear brake recording little or no effort (3.7.b.5a) Offside rear brake recording little or no effort (3.7.b.5a) 04 October 2017 [11:42] 04/10/2017 09 June 2014 [13:13] 09/06/2014 23 May 2013 [12:32] 23/05/2013 478391401672 478391401672 326710664135 326710664135 947263143148 947263143148
3 Nearside rear brake recording little or no effort (3.7.b.5a) Nearside rear brake recording little or no effort (3.7.b.5a) 09 June 2014 [13:13] 09/06/2014 23 May 2013 [12:32] 23/05/2013 01 March 2012 [15:53] 01/03/2012 326710664135 326710664135 947263143148 947263143148 105251962018 105251962018
3 Nearside rear parking brake recording little or no effort (3.7.b.6a) Nearside rear parking brake recording little or no effort (3.7.b.6a) 09 June 2014 [13:13] 09/06/2014 23 May 2013 [12:32] 23/05/2013 01 March 2012 [15:53] 01/03/2012 326710664135 326710664135 947263143148 947263143148 105251962018 105251962018
2 Offside inner body or chassis has excessive corrosion, seriously affecting its strength within 30cm of the body mountings (6.1.b.2) Offside inner body or chassis has excessive corrosion, seriously affecting its strength within 30cm of the body mountings (6.1.b.2) 12 August 2015 [13:34] 12/08/2015 09 June 2014 [13:13] 09/06/2014 537424025259 537424025259 326710664135 326710664135
2 Offside rear braking system leaking (3.6.a.1) Offside rear braking system leaking (3.6.a.1) 09 June 2014 [13:13] 09/06/2014 01 March 2012 [15:53] 01/03/2012 326710664135 326710664135 105251962018 105251962018
2 Offside rear parking brake recording little or no effort (3.7.b.6a) Offside rear parking brake recording little or no effort (3.7.b.6a) 09 June 2014 [13:13] 09/06/2014 23 May 2013 [12:32] 23/05/2013 326710664135 326710664135 947263143148 947263143148
1 Registration plate lamp not working (1.1.c.1d) Registration plate lamp not working (1.1.c.1d) 14 August 2017 [13:51] 14/08/2017 199404547427 199404547427
1 Offside rear body insecure and dangerous to other road users (6.1.b.1b) Offside rear body insecure and dangerous to other road users (6.1.b.1b) 14 August 2017 [13:51] 14/08/2017 199404547427 199404547427
1 Nearside body or chassis has excessive corrosion, seriously affecting its strength within 30cm of the body mountings floor (6.1.b.2) Nearside body or chassis has excessive corrosion, seriously affecting its strength within 30cm of the body mountings floor (6.1.b.2) 14 August 2017 [13:51] 14/08/2017 199404547427 199404547427
1 Offside body or chassis has excessive corrosion, seriously affecting its strength within 30cm of the body mountings floor (6.1.b.2) Offside body or chassis has excessive corrosion, seriously affecting its strength within 30cm of the body mountings floor (6.1.b.2) 14 August 2017 [13:51] 14/08/2017 199404547427 199404547427
1 Offside front steering rack gaiter split (2.2.d.2d) Offside front steering rack gaiter split (2.2.d.2d) 14 August 2017 [13:51] 14/08/2017 199404547427 199404547427
1 Nearside front inner body or chassis has excessive corrosion, seriously affecting its strength within 30cm of the body mountings arch (6.1.b.2) Nearside front inner body or chassis has excessive corrosion, seriously affecting its strength within 30cm of the body mountings arch (6.1.b.2) 14 August 2017 [13:51] 14/08/2017 199404547427 199404547427
1 Offside rear body or chassis has excessive corrosion, seriously affecting its strength within 30cm of the body mountings floor spring mounting (6.1.b.2) Offside rear body or chassis has excessive corrosion, seriously affecting its strength within 30cm of the body mountings floor spring mounting (6.1.b.2) 14 August 2017 [13:51] 14/08/2017 199404547427 199404547427
1 Offside rear inner body or chassis has excessive corrosion, seriously affecting its strength within 30cm of the body mountings arch (6.1.b.2) Offside rear inner body or chassis has excessive corrosion, seriously affecting its strength within 30cm of the body mountings arch (6.1.b.2) 14 August 2017 [13:51] 14/08/2017 199404547427 199404547427
1 Nearside rear outer body or chassis has excessive corrosion, seriously affecting its strength within 30cm of the body mountings sill (6.1.b.2) Nearside rear outer body or chassis has excessive corrosion, seriously affecting its strength within 30cm of the body mountings sill (6.1.b.2) 14 August 2017 [13:51] 14/08/2017 199404547427 199404547427
1 Offside body or chassis has excessive corrosion, seriously affecting its strength within 30cm of the body mountings boot floor (6.1.b.2) Offside body or chassis has excessive corrosion, seriously affecting its strength within 30cm of the body mountings boot floor (6.1.b.2) 14 August 2017 [13:51] 14/08/2017 199404547427 199404547427
1 Offside rear rear position lamp(s) not working (1.1.a.3b) Offside rear rear position lamp(s) not working (1.1.a.3b) 14 August 2017 [13:51] 14/08/2017 199404547427 199404547427
1 Battery insecure (1.9.1) Battery insecure (1.9.1) 14 August 2017 [13:51] 14/08/2017 199404547427 199404547427
1 Nearside front inner vehicle structure has excessive corrosion, seriously affecting its strength within 30cm of the body mountings (6.1.b.2) Nearside front inner vehicle structure has excessive corrosion, seriously affecting its strength within 30cm of the body mountings (6.1.b.2) 22 July 2016 [14:09] 22/07/2016 344483998648 344483998648
1 Nearside front tyre tread depth below requirements of 1.6mm (4.1.e.1) Nearside front tyre tread depth below requirements of 1.6mm (4.1.e.1) 22 July 2016 [14:09] 22/07/2016 344483998648 344483998648
1 Offside inner body or chassis has excessive corrosion, seriously affecting its strength within 30cm of the body mountings floor (6.1.b.2) Offside inner body or chassis has excessive corrosion, seriously affecting its strength within 30cm of the body mountings floor (6.1.b.2) 22 July 2016 [14:09] 22/07/2016 344483998648 344483998648
1 Offside front body or chassis has excessive corrosion, seriously affecting its strength within 30cm of the body mountings (6.1.b.2) Offside front body or chassis has excessive corrosion, seriously affecting its strength within 30cm of the body mountings (6.1.b.2) 12 August 2015 [13:34] 12/08/2015 537424025259 537424025259
1 Nearside steering rack gaiter split (2.2.d.2d) Nearside steering rack gaiter split (2.2.d.2d) 12 August 2015 [13:34] 12/08/2015 537424025259 537424025259
1 Nearside body or chassis has excessive corrosion, seriously affecting its strength within 30cm of the body mountings (6.1.b.2) Nearside body or chassis has excessive corrosion, seriously affecting its strength within 30cm of the body mountings (6.1.b.2) 12 August 2015 [13:34] 12/08/2015 537424025259 537424025259
1 Offside rear position lamp(s) not working (1.1.a.3b) Offside rear position lamp(s) not working (1.1.a.3b) 09 June 2014 [13:13] 09/06/2014 326710664135 326710664135
1 Offside front vehicle structure has excessive corrosion, seriously affecting its strength within 30cm of the body mountings (6.1.b.2) Offside front vehicle structure has excessive corrosion, seriously affecting its strength within 30cm of the body mountings (6.1.b.2) 09 June 2014 [13:13] 09/06/2014 326710664135 326710664135
1 Offside rear vehicle structure has excessive corrosion, seriously affecting its strength within 30cm of the body mountings (6.1.b.2) Offside rear vehicle structure has excessive corrosion, seriously affecting its strength within 30cm of the body mountings (6.1.b.2) 09 June 2014 [13:13] 09/06/2014 326710664135 326710664135
1 Exhaust has a major leak of exhaust gases (7.1.2) Exhaust has a major leak of exhaust gases (7.1.2) 09 June 2014 [13:13] 09/06/2014 326710664135 326710664135
1 Exhaust system not adequately supported (7.1.1) Exhaust system not adequately supported (7.1.1) 09 June 2014 [13:13] 09/06/2014 326710664135 326710664135
1 Exhaust noise is clearly in excess of that emitted by a similar vehicle fitted with a standard silencer in average condition (7.1.4) Exhaust noise is clearly in excess of that emitted by a similar vehicle fitted with a standard silencer in average condition (7.1.4) 09 June 2014 [13:13] 09/06/2014 326710664135 326710664135
1 Offside track rod end ball joint dust cover excessively deteriorated so that it no longer prevents the ingress of dirt (2.2.c.1c) Offside track rod end ball joint dust cover excessively deteriorated so that it no longer prevents the ingress of dirt (2.2.c.1c) 09 June 2014 [13:13] 09/06/2014 326710664135 326710664135
1 Offside steering rack gaiter split (2.2.d.2d) Offside steering rack gaiter split (2.2.d.2d) 09 June 2014 [13:13] 09/06/2014 326710664135 326710664135
1 Brakes imbalanced across an axle (3.7.b.5b) Brakes imbalanced across an axle (3.7.b.5b) 09 June 2014 [13:13] 09/06/2014 326710664135 326710664135
1 Offside front track rod end ball joint has excessive play (2.2.b.1f) Offside front track rod end ball joint has excessive play (2.2.b.1f) 23 May 2013 [12:32] 23/05/2013 947263143148 947263143148
1 Nearside rear brake drum contaminated by oil (3.5.1h) Nearside rear brake drum contaminated by oil (3.5.1h) 23 May 2013 [12:32] 23/05/2013 947263143148 947263143148
1 Parking brake lever has no reserve travel (3.1.6b) Parking brake lever has no reserve travel (3.1.6b) 23 May 2013 [12:32] 23/05/2013 947263143148 947263143148
1 Nearside steering rack gaiter insecure (2.2.d.2d) Nearside steering rack gaiter insecure (2.2.d.2d) 01 March 2012 [15:53] 01/03/2012 105251962018 105251962018
1 Offside steering rack gaiter insecure (2.2.d.2d) Offside steering rack gaiter insecure (2.2.d.2d) 01 March 2012 [15:53] 01/03/2012 105251962018 105251962018
1 Nearside rear braking system leaking (3.6.a.1) Nearside rear braking system leaking (3.6.a.1) 01 March 2012 [15:53] 01/03/2012 105251962018 105251962018
1 Brake pedal spongy (3.3.b.1b) Brake pedal spongy (3.3.b.1b) 01 March 2012 [15:53] 01/03/2012 105251962018 105251962018
1 Brake pedal creeps down while the pedal is held under pressure (3.3.b.1a) Brake pedal creeps down while the pedal is held under pressure (3.3.b.1a) 01 March 2012 [15:53] 01/03/2012 105251962018 105251962018
1 Front passenger door cannot be opened from inside the vehicle (6.2.b.1b) Front passenger door cannot be opened from inside the vehicle (6.2.b.1b) 25 January 2011 [11:38] 25/01/2011 978595221000 978595221000
1 Front passenger door cannot be opened from outside the vehicle (6.2.b.1b) Front passenger door cannot be opened from outside the vehicle (6.2.b.1b) 25 January 2011 [11:38] 25/01/2011 978595221000 978595221000
1 Nearside headlamp not working on dipped beam (1.7.5a) Nearside headlamp not working on dipped beam (1.7.5a) 07 June 2007 [17:40] 07/06/2007 454828157132 454828157132
1 Nearside rear position lamp(s) excessively deteriorated so that it is not visible from a reasonable distance (1.1.a.3d) Nearside rear position lamp(s) excessively deteriorated so that it is not visible from a reasonable distance (1.1.a.3d) 07 June 2007 [17:40] 07/06/2007 454828157132 454828157132

ALL 827 UXY Pass With Rectification Faults [2]

ALL Pass With Rectification faults, ORDERED by OCCURRENCE DURING 827 UXY's MOT HISTORY
ALL 827 UXY Pass With Rectification Faults [2]
ALL Pass With Rectification faults, ORDERED by OCCURRENCE DURING 827 UXY's MOT HISTORY
Fail Faults | source www.vehiclestats.co.uk
Fault Fault Test Date Test Date/Time Reference MOT Test Reference
1 Nearside semaphore indicator arm does not extend smoothly (1.4.c.1a) Nearside semaphore indicator arm does not extend smoothly (1.4.c.1a) 04 June 2008 [13:55] 04/06/2008 961226058111 961226058111
1 Windscreen washer provides insufficient washer liquid (8.2.3) Windscreen washer provides insufficient washer liquid (8.2.3) 04 June 2008 [13:55] 04/06/2008 961226058111 961226058111

MOT TEST: 06 October 2017 14:26:33 PASSED
MOT TEST: 06 October 2017 14:26:33 PASSED

This test (721159219052) was completed on the 06 October 2017 14:26:33 and PASSED the requirements for a valid MOT with 0 comments.

This test (721159219052) was completed on the 06 October 2017 14:26:33 and PASSED the requirements for a valid MOT with 0 comments.

Recorded mileage: 47,054

Recorded mileage: 47,054


MOT TEST: 04 October 2017 11:42:36 FAILED
MOT TEST: 04 October 2017 11:42:36 FAILED

This test (478391401672) was completed on the 04 October 2017 11:42:36 and FAILED the requirements for a valid MOT with 2 comments.

This test (478391401672) was completed on the 04 October 2017 11:42:36 and FAILED the requirements for a valid MOT with 2 comments.

Recorded mileage: 47,053

Recorded mileage: 47,053


FAIL


MOT TEST: 14 August 2017 13:51:40 FAILED
MOT TEST: 14 August 2017 13:51:40 FAILED

This test (199404547427) was completed on the 14 August 2017 13:51:40 and FAILED the requirements for a valid MOT with 18 comments.

This test (199404547427) was completed on the 14 August 2017 13:51:40 and FAILED the requirements for a valid MOT with 18 comments.

Recorded mileage: 46,990

Recorded mileage: 46,990


ADVISORY

FAIL


MOT TEST: 03 August 2016 08:21:36 PASSED
MOT TEST: 03 August 2016 08:21:36 PASSED

This test (481198629695) was completed on the 03 August 2016 08:21:36 and PASSED the requirements for a valid MOT with 0 comments.

This test (481198629695) was completed on the 03 August 2016 08:21:36 and PASSED the requirements for a valid MOT with 0 comments.

Recorded mileage: 42,053

Recorded mileage: 42,053


MOT TEST: 22 July 2016 14:09:52 FAILED
MOT TEST: 22 July 2016 14:09:52 FAILED

This test (344483998648) was completed on the 22 July 2016 14:09:52 and FAILED the requirements for a valid MOT with 4 comments.

This test (344483998648) was completed on the 22 July 2016 14:09:52 and FAILED the requirements for a valid MOT with 4 comments.

Recorded mileage: 42,052

Recorded mileage: 42,052


FAIL


MOT TEST: 07 September 2015 15:20:44 PASSED
MOT TEST: 07 September 2015 15:20:44 PASSED

This test (265873861035) was completed on the 07 September 2015 15:20:44 and PASSED the requirements for a valid MOT with 0 comments.

This test (265873861035) was completed on the 07 September 2015 15:20:44 and PASSED the requirements for a valid MOT with 0 comments.

Recorded mileage: 36,301

Recorded mileage: 36,301


MOT TEST: 12 August 2015 13:34:41 FAILED
MOT TEST: 12 August 2015 13:34:41 FAILED

This test (537424025259) was completed on the 12 August 2015 13:34:41 and FAILED the requirements for a valid MOT with 6 comments.

This test (537424025259) was completed on the 12 August 2015 13:34:41 and FAILED the requirements for a valid MOT with 6 comments.

Recorded mileage: 36,272

Recorded mileage: 36,272


ADVISORY

FAIL


MOT TEST: 20 June 2014 16:08:27 PASSED
MOT TEST: 20 June 2014 16:08:27 PASSED

This test (268451974138) was completed on the 20 June 2014 16:08:27 and PASSED the requirements for a valid MOT with 0 comments.

This test (268451974138) was completed on the 20 June 2014 16:08:27 and PASSED the requirements for a valid MOT with 0 comments.

Recorded mileage: 27,630

Recorded mileage: 27,630


MOT TEST: 09 June 2014 13:13:20 FAILED
MOT TEST: 09 June 2014 13:13:20 FAILED

This test (326710664135) was completed on the 09 June 2014 13:13:20 and FAILED the requirements for a valid MOT with 17 comments.

This test (326710664135) was completed on the 09 June 2014 13:13:20 and FAILED the requirements for a valid MOT with 17 comments.

Recorded mileage: 27,628

Recorded mileage: 27,628


FAIL


MOT TEST: 30 May 2013 12:01:34 PASSED
MOT TEST: 30 May 2013 12:01:34 PASSED

This test (117620953145) was completed on the 30 May 2013 12:01:34 and PASSED the requirements for a valid MOT with 0 comments.

This test (117620953145) was completed on the 30 May 2013 12:01:34 and PASSED the requirements for a valid MOT with 0 comments.

Recorded mileage: 21,113

Recorded mileage: 21,113


MOT TEST: 23 May 2013 12:32:21 FAILED
MOT TEST: 23 May 2013 12:32:21 FAILED

This test (947263143148) was completed on the 23 May 2013 12:32:21 and FAILED the requirements for a valid MOT with 11 comments.

This test (947263143148) was completed on the 23 May 2013 12:32:21 and FAILED the requirements for a valid MOT with 11 comments.

Recorded mileage: 21,111

Recorded mileage: 21,111


ADVISORY

FAIL


MOT TEST: 09 March 2012 16:48:31 PASSED
MOT TEST: 09 March 2012 16:48:31 PASSED

This test (535169962077) was completed on the 09 March 2012 16:48:31 and PASSED the requirements for a valid MOT with 0 comments.

This test (535169962077) was completed on the 09 March 2012 16:48:31 and PASSED the requirements for a valid MOT with 0 comments.

Recorded mileage: 11,463

Recorded mileage: 11,463


MOT TEST: 01 March 2012 15:53:42 FAILED
MOT TEST: 01 March 2012 15:53:42 FAILED

This test (105251962018) was completed on the 01 March 2012 15:53:42 and FAILED the requirements for a valid MOT with 10 comments.

This test (105251962018) was completed on the 01 March 2012 15:53:42 and FAILED the requirements for a valid MOT with 10 comments.

Recorded mileage: 11,335

Recorded mileage: 11,335


FAIL


MOT TEST: 25 January 2011 14:11:03 PASSED
MOT TEST: 25 January 2011 14:11:03 PASSED

This test (686095221050) was completed on the 25 January 2011 14:11:03 and PASSED the requirements for a valid MOT with 0 comments.

This test (686095221050) was completed on the 25 January 2011 14:11:03 and PASSED the requirements for a valid MOT with 0 comments.

Recorded mileage: 3,808

Recorded mileage: 3,808


MOT TEST: 25 January 2011 11:38:46 FAILED
MOT TEST: 25 January 2011 11:38:46 FAILED

This test (978595221000) was completed on the 25 January 2011 11:38:46 and FAILED the requirements for a valid MOT with 2 comments.

This test (978595221000) was completed on the 25 January 2011 11:38:46 and FAILED the requirements for a valid MOT with 2 comments.

Recorded mileage: 3,808

Recorded mileage: 3,808


FAIL


MOT TEST: 04 June 2008 13:59:33 PASSED
MOT TEST: 04 June 2008 13:59:33 PASSED

This test (431326458196) was completed on the 04 June 2008 13:59:33 and PASSED the requirements for a valid MOT with 0 comments.

This test (431326458196) was completed on the 04 June 2008 13:59:33 and PASSED the requirements for a valid MOT with 0 comments.

Recorded mileage: 37,705

Recorded mileage: 37,705


MOT TEST: 04 June 2008 13:55:28 FAILED
MOT TEST: 04 June 2008 13:55:28 FAILED

This test (961226058111) was completed on the 04 June 2008 13:55:28 and FAILED the requirements for a valid MOT with 3 comments.

This test (961226058111) was completed on the 04 June 2008 13:55:28 and FAILED the requirements for a valid MOT with 3 comments.

Recorded mileage: 37,705

Recorded mileage: 37,705


FAIL

PASS WITH RECTIFICATION


MOT TEST: 08 June 2007 13:24:04 PASSED
MOT TEST: 08 June 2007 13:24:04 PASSED

This test (562979357182) was completed on the 08 June 2007 13:24:04 and PASSED the requirements for a valid MOT with 0 comments.

This test (562979357182) was completed on the 08 June 2007 13:24:04 and PASSED the requirements for a valid MOT with 0 comments.

Recorded mileage: 3,653

Recorded mileage: 3,653


MOT TEST: 07 June 2007 17:40:51 FAILED
MOT TEST: 07 June 2007 17:40:51 FAILED

This test (454828157132) was completed on the 07 June 2007 17:40:51 and FAILED the requirements for a valid MOT with 2 comments.

This test (454828157132) was completed on the 07 June 2007 17:40:51 and FAILED the requirements for a valid MOT with 2 comments.

Recorded mileage: 3,653

Recorded mileage: 3,653


FAIL


MOT TEST: 22 June 2006 16:17:25 PASSED
MOT TEST: 22 June 2006 16:17:25 PASSED

This test (334413576136) was completed on the 22 June 2006 16:17:25 and PASSED the requirements for a valid MOT with 0 comments.

This test (334413576136) was completed on the 22 June 2006 16:17:25 and PASSED the requirements for a valid MOT with 0 comments.

Recorded mileage: 3,138

Recorded mileage: 3,138