828 UXD


828UXD is registered to a Grey 1959, Morris with a Petrol engine. It Failed its most recent MOT Test on the 15 June 2015

22 unique faults (26 Total) reported in its MOT History (12 Tests).

4 common/recurring faults, the most frequent (2 times) is: slighy play in nearside and offside front upper trunnions and uprights.

67% (8) MOT Pass Rate and a 33% (4) MOT Failure Rate.

73,664 recorded miles.

828 UXD


828UXD is registered to a Grey 1959, Morris with a Petrol engine. It Failed its most recent MOT Test on the 15 June 2015

22 unique faults (26 Total) reported in its MOT History (12 Tests).

4 common/recurring faults, the most frequent (2 times) is: slighy play in nearside and offside front upper trunnions and uprights.

67% (8) MOT Pass Rate and a 33% (4) MOT Failure Rate.

73,664 recorded miles.

MOT PASS/Failure rate for 828 UXD

all MOT test results for 828 UXD represented as a percentage
MOT PASS/Failure rate for 828 UXD
all MOT test results for 828 UXD represented as a percentage

PERCENTAGE OF VEHICLE FAULTS WITH 828 UXD

ALL REPORTED FAULTS, DISPLAYED BY PERCENTAGE OF OCCURRENCE DURING ALL MOT TESTS
PERCENTAGE OF VEHICLE FAULTS WITH 828 UXD
ALL REPORTED FAULTS, DISPLAYED BY PERCENTAGE OF OCCURRENCE DURING ALL MOT TESTS
ADVISORY

FAIL

USER ENTERED

PASS WITH RECTIFICATION

828 UXD annual Faults by type

ALL REPORTED FAULTS, DISPLAYED over time and categorised by type
828 UXD annual Faults by type
ALL REPORTED FAULTS, DISPLAYED over time and categorised by type

RECURRING FAULTS WITH 828 UXD

FAULTS THAT HAVE OCCURED MORE THAN ONCE DURING 828 UXD's MOT HISTORY
RECURRING FAULTS WITH 828 UXD
FAULTS THAT HAVE OCCURED MORE THAN ONCE DURING 828 UXD's MOT HISTORY
Fault Fault Test Date Test Date/Time Reference MOT Test Reference
2 Slighy play in nearside and offside front upper trunnions and uprights Slighy play in nearside and offside front upper trunnions and uprights 15 June 2015 [11:42] 15/06/2015 15 June 2015 [11:42] 15/06/2015 628966665147 628966665147 288126465420 288126465420
2 All four tyres slight perishing All four tyres slight perishing 12 June 2008 [08:38] 12/06/2008 30 May 2008 [16:41] 30/05/2008 980044768150 980044768150 423861358145 423861358145
2 Nearside rear brake recording little or no effort (3.7.b.5a) Nearside rear brake recording little or no effort (3.7.b.5a) 30 May 2008 [16:41] 30/05/2008 12 April 2006 [17:14] 12/04/2006 423861358145 423861358145 560332306125 560332306125
2 Parking brake: efficiency below requirements (3.7.b.7) Parking brake: efficiency below requirements (3.7.b.7) 30 May 2008 [16:41] 30/05/2008 12 April 2006 [17:14] 12/04/2006 423861358145 423861358145 560332306125 560332306125

ALL 828 UXD ADVISORIES [2]

ALL ADVISORIES, ORDERED by OCCURRENCE DURING 828 UXD's MOT HISTORY
ALL 828 UXD ADVISORIES [2]
ALL ADVISORIES, ORDERED by OCCURRENCE DURING 828 UXD's MOT HISTORY
Advisory Faults | source www.vehiclestats.co.uk
Fault Fault Test Date Test Date/Time Reference MOT Test Reference
1 Nearside front suspension has slight play in a upper suspension ball joint (2.5.b.1a) Nearside front suspension has slight play in a upper suspension ball joint (2.5.b.1a) 06 June 2012 [13:33] 06/06/2012 259568652121 259568652121
1 Service brake: service brake efficiency only just met. It would appear that the braking system requires adjustment or repair. (3.7.b.7) Service brake: service brake efficiency only just met. It would appear that the braking system requires adjustment or repair. (3.7.b.7) 24 April 2006 [12:01] 24/04/2006 103604316132 103604316132

ALL 828 UXD Failure Faults [13]

ALL Failure faults, ORDERED by OCCURRENCE DURING 828 UXD's MOT HISTORY
ALL 828 UXD Failure Faults [13]
ALL Failure faults, ORDERED by OCCURRENCE DURING 828 UXD's MOT HISTORY
Fail Faults | source www.vehiclestats.co.uk
Fault Fault Test Date Test Date/Time Reference MOT Test Reference
2 Nearside rear brake recording little or no effort (3.7.b.5a) Nearside rear brake recording little or no effort (3.7.b.5a) 30 May 2008 [16:41] 30/05/2008 12 April 2006 [17:14] 12/04/2006 423861358145 423861358145 560332306125 560332306125
2 Parking brake: efficiency below requirements (3.7.b.7) Parking brake: efficiency below requirements (3.7.b.7) 30 May 2008 [16:41] 30/05/2008 12 April 2006 [17:14] 12/04/2006 423861358145 423861358145 560332306125 560332306125
1 Parking brake lever has no reserve travel (3.1.6b) Parking brake lever has no reserve travel (3.1.6b) 30 May 2008 [16:41] 30/05/2008 423861358145 423861358145
1 Service brake: efficiency below requirements (3.7.b.7) Service brake: efficiency below requirements (3.7.b.7) 30 May 2008 [16:41] 30/05/2008 423861358145 423861358145
1 Offside rear seat belt has a cut which has significantly weakened the webbing (5.2.2a) Offside rear seat belt has a cut which has significantly weakened the webbing (5.2.2a) 24 April 2006 [12:01] 24/04/2006 103604316132 103604316132
1 Nearside rear mechanical brake component has restricted free movement (3.5.1k) Nearside rear mechanical brake component has restricted free movement (3.5.1k) 24 April 2006 [12:01] 24/04/2006 103604316132 103604316132
1 Front headlamp aim too high (hotspot upper edge above the horizontal 0% line) (1.6.d1) Front headlamp aim too high (hotspot upper edge above the horizontal 0% line) (1.6.d1) 24 April 2006 [12:01] 24/04/2006 103604316132 103604316132
1 Nearside windscreen wiper does not clear the windscreen effectively (8.2.2) Nearside windscreen wiper does not clear the windscreen effectively (8.2.2) 12 April 2006 [17:14] 12/04/2006 560332306125 560332306125
1 Offside windscreen wiper does not clear the windscreen effectively (8.2.2) Offside windscreen wiper does not clear the windscreen effectively (8.2.2) 12 April 2006 [17:14] 12/04/2006 560332306125 560332306125
1 Nearside rear registration plate lamp not working (1.1.5c) Nearside rear registration plate lamp not working (1.1.5c) 12 April 2006 [17:14] 12/04/2006 560332306125 560332306125
1 Steering system excessively rough (2.2.d.1) Steering system excessively rough (2.2.d.1) 12 April 2006 [17:14] 12/04/2006 560332306125 560332306125

ALL 828 UXD User Entered Faults [9]

ALL User Entered faults, ORDERED by OCCURRENCE DURING 828 UXD's MOT HISTORY
ALL 828 UXD User Entered Faults [9]
ALL User Entered faults, ORDERED by OCCURRENCE DURING 828 UXD's MOT HISTORY
User Entered Faults | source www.vehiclestats.co.uk
Fault Fault Test Date Test Date/Time Reference MOT Test Reference
2 Slighy play in nearside and offside front upper trunnions and uprights Slighy play in nearside and offside front upper trunnions and uprights 15 June 2015 [11:42] 15/06/2015 15 June 2015 [11:42] 15/06/2015 628966665147 628966665147 288126465420 288126465420
2 All four tyres slight perishing All four tyres slight perishing 12 June 2008 [08:38] 12/06/2008 30 May 2008 [16:41] 30/05/2008 980044768150 980044768150 423861358145 423861358145
1 Offside rear tyre perishing Offside rear tyre perishing 06 June 2012 [13:33] 06/06/2012 259568652121 259568652121
1 Front brakes do not achieve lock out Front brakes do not achieve lock out 29 April 2006 [13:33] 29/04/2006 473119016149 473119016149
1 Front brake imbalance at 25% Front brake imbalance at 25% 29 April 2006 [13:33] 29/04/2006 473119016149 473119016149
1 Nearside rear brake low effort Nearside rear brake low effort 29 April 2006 [13:33] 29/04/2006 473119016149 473119016149
1 Sliht wear in front suspension upper & lower trunions Sliht wear in front suspension upper & lower trunions 12 April 2006 [17:14] 12/04/2006 560332306125 560332306125

ALL 828 UXD Pass With Rectification Faults [2]

ALL Pass With Rectification faults, ORDERED by OCCURRENCE DURING 828 UXD's MOT HISTORY
ALL 828 UXD Pass With Rectification Faults [2]
ALL Pass With Rectification faults, ORDERED by OCCURRENCE DURING 828 UXD's MOT HISTORY
Pass With Rectification Faults | source www.vehiclestats.co.uk
Fault Fault Test Date Test Date/Time Reference MOT Test Reference
1 Nearside stop lamp not working (1.2.1b) Nearside stop lamp not working (1.2.1b) 15 June 2015 [11:42] 15/06/2015 288126465420 288126465420
1 Nearside rear position lamp(s) not working (1.1.a.3b) Nearside rear position lamp(s) not working (1.1.a.3b) 15 June 2015 [11:42] 15/06/2015 288126465420 288126465420

MOT TEST: 15 June 2015 11:42:17 PASSED
MOT TEST: 15 June 2015 11:42:17 PASSED

This test (628966665147) was completed on the 15 June 2015 11:42:17 and PASSED the requirements for a valid MOT with 1 comments.

This test (628966665147) was completed on the 15 June 2015 11:42:17 and PASSED the requirements for a valid MOT with 1 comments.

Recorded mileage: 73,664

Recorded mileage: 73,664


USER ENTERED


MOT TEST: 15 June 2015 11:42:17 FAILED
MOT TEST: 15 June 2015 11:42:17 FAILED

This test (288126465420) was completed on the 15 June 2015 11:42:17 and FAILED the requirements for a valid MOT with 3 comments.

This test (288126465420) was completed on the 15 June 2015 11:42:17 and FAILED the requirements for a valid MOT with 3 comments.

Recorded mileage: 73,664

Recorded mileage: 73,664


USER ENTERED

PASS WITH RECTIFICATION


MOT TEST: 06 June 2012 13:33:08 PASSED
MOT TEST: 06 June 2012 13:33:08 PASSED

This test (259568652121) was completed on the 06 June 2012 13:33:08 and PASSED the requirements for a valid MOT with 2 comments.

This test (259568652121) was completed on the 06 June 2012 13:33:08 and PASSED the requirements for a valid MOT with 2 comments.

Recorded mileage: 73,428

Recorded mileage: 73,428


ADVISORY

USER ENTERED


MOT TEST: 07 June 2011 12:07:08 PASSED
MOT TEST: 07 June 2011 12:07:08 PASSED

This test (329368451162) was completed on the 07 June 2011 12:07:08 and PASSED the requirements for a valid MOT with 0 comments.

This test (329368451162) was completed on the 07 June 2011 12:07:08 and PASSED the requirements for a valid MOT with 0 comments.

Recorded mileage: 73,156

Recorded mileage: 73,156


MOT TEST: 09 June 2010 13:31:01 PASSED
MOT TEST: 09 June 2010 13:31:01 PASSED

This test (793670860103) was completed on the 09 June 2010 13:31:01 and PASSED the requirements for a valid MOT with 0 comments.

This test (793670860103) was completed on the 09 June 2010 13:31:01 and PASSED the requirements for a valid MOT with 0 comments.

Recorded mileage: 72,853

Recorded mileage: 72,853


MOT TEST: 10 June 2009 16:01:24 PASSED
MOT TEST: 10 June 2009 16:01:24 PASSED

This test (220151969469) was completed on the 10 June 2009 16:01:24 and PASSED the requirements for a valid MOT with 0 comments.

This test (220151969469) was completed on the 10 June 2009 16:01:24 and PASSED the requirements for a valid MOT with 0 comments.

Recorded mileage: 72,021

Recorded mileage: 72,021


MOT TEST: 12 June 2008 08:38:38 PASSED
MOT TEST: 12 June 2008 08:38:38 PASSED

This test (980044768150) was completed on the 12 June 2008 08:38:38 and PASSED the requirements for a valid MOT with 1 comments.

This test (980044768150) was completed on the 12 June 2008 08:38:38 and PASSED the requirements for a valid MOT with 1 comments.

Recorded mileage: 71,503

Recorded mileage: 71,503


USER ENTERED


MOT TEST: 30 May 2008 16:41:15 FAILED
MOT TEST: 30 May 2008 16:41:15 FAILED

This test (423861358145) was completed on the 30 May 2008 16:41:15 and FAILED the requirements for a valid MOT with 5 comments.

This test (423861358145) was completed on the 30 May 2008 16:41:15 and FAILED the requirements for a valid MOT with 5 comments.

Recorded mileage: 71,503

Recorded mileage: 71,503


FAIL

USER ENTERED


MOT TEST: 11 June 2007 11:37:08 PASSED
MOT TEST: 11 June 2007 11:37:08 PASSED

This test (364452567105) was completed on the 11 June 2007 11:37:08 and PASSED the requirements for a valid MOT with 0 comments.

This test (364452567105) was completed on the 11 June 2007 11:37:08 and PASSED the requirements for a valid MOT with 0 comments.

Recorded mileage: 71,006

Recorded mileage: 71,006


MOT TEST: 29 April 2006 13:33:37 PASSED
MOT TEST: 29 April 2006 13:33:37 PASSED

This test (473119016149) was completed on the 29 April 2006 13:33:37 and PASSED the requirements for a valid MOT with 3 comments.

This test (473119016149) was completed on the 29 April 2006 13:33:37 and PASSED the requirements for a valid MOT with 3 comments.

Recorded mileage: 69,049

Recorded mileage: 69,049


USER ENTERED


MOT TEST: 24 April 2006 12:01:33 FAILED
MOT TEST: 24 April 2006 12:01:33 FAILED

This test (103604316132) was completed on the 24 April 2006 12:01:33 and FAILED the requirements for a valid MOT with 4 comments.

This test (103604316132) was completed on the 24 April 2006 12:01:33 and FAILED the requirements for a valid MOT with 4 comments.

Recorded mileage: 69,008

Recorded mileage: 69,008


ADVISORY

FAIL


MOT TEST: 12 April 2006 17:14:32 FAILED
MOT TEST: 12 April 2006 17:14:32 FAILED

This test (560332306125) was completed on the 12 April 2006 17:14:32 and FAILED the requirements for a valid MOT with 7 comments.

This test (560332306125) was completed on the 12 April 2006 17:14:32 and FAILED the requirements for a valid MOT with 7 comments.

Recorded mileage: 68,965

Recorded mileage: 68,965


FAIL

USER ENTERED