828 VYD


828VYD is registered to a Grey 1964, Morris Minor 1000 with a Petrol engine. It Failed its most recent MOT Test on the 11 February 2013

8 unique faults (8 Total) reported in its MOT History (4 Tests).

0 common/recurring faults.

75% (3) MOT Pass Rate and a 25% (1) MOT Failure Rate.

95,125 recorded miles.

828 VYD


828VYD is registered to a Grey 1964, Morris Minor 1000 with a Petrol engine. It Failed its most recent MOT Test on the 11 February 2013

8 unique faults (8 Total) reported in its MOT History (4 Tests).

0 common/recurring faults.

75% (3) MOT Pass Rate and a 25% (1) MOT Failure Rate.

95,125 recorded miles.

MOT PASS/Failure rate for 828 VYD

all MOT test results for 828 VYD represented as a percentage
MOT PASS/Failure rate for 828 VYD
all MOT test results for 828 VYD represented as a percentage

PERCENTAGE OF VEHICLE FAULTS WITH 828 VYD

ALL REPORTED FAULTS, DISPLAYED BY PERCENTAGE OF OCCURRENCE DURING ALL MOT TESTS
PERCENTAGE OF VEHICLE FAULTS WITH 828 VYD
ALL REPORTED FAULTS, DISPLAYED BY PERCENTAGE OF OCCURRENCE DURING ALL MOT TESTS
FAIL

828 VYD annual Faults by type

ALL REPORTED FAULTS, DISPLAYED over time and categorised by type
828 VYD annual Faults by type
ALL REPORTED FAULTS, DISPLAYED over time and categorised by type

ALL 828 VYD Failure Faults [8]

ALL Failure faults, ORDERED by OCCURRENCE DURING 828 VYD's MOT HISTORY
ALL 828 VYD Failure Faults [8]
ALL Failure faults, ORDERED by OCCURRENCE DURING 828 VYD's MOT HISTORY
Fail Faults | source www.vehiclestats.co.uk
Fault Fault Test Date Test Date/Time Reference MOT Test Reference
1 Nearside headlamp not working on dipped beam (1.7.5a) Nearside headlamp not working on dipped beam (1.7.5a) 24 January 2011 [12:05] 24/01/2011 447134721074 447134721074
1 Nearside headlamp insecure (1.7.3) Nearside headlamp insecure (1.7.3) 24 January 2011 [12:05] 24/01/2011 447134721074 447134721074
1 Nearside front front brake recording little or no effort (3.7.b.5a) Nearside front front brake recording little or no effort (3.7.b.5a) 24 January 2011 [12:05] 24/01/2011 447134721074 447134721074
1 Nearside rear front brake recording little or no effort (3.7.b.5a) Nearside rear front brake recording little or no effort (3.7.b.5a) 24 January 2011 [12:05] 24/01/2011 447134721074 447134721074
1 Offside rear front brake recording little or no effort (3.7.b.5a) Offside rear front brake recording little or no effort (3.7.b.5a) 24 January 2011 [12:05] 24/01/2011 447134721074 447134721074
1 Offside front parking brake recording little or no effort (3.7.b.6a) Offside front parking brake recording little or no effort (3.7.b.6a) 24 January 2011 [12:05] 24/01/2011 447134721074 447134721074
1 Service brake: efficiency below requirements (3.7.b.7) Service brake: efficiency below requirements (3.7.b.7) 24 January 2011 [12:05] 24/01/2011 447134721074 447134721074
1 Parking brake: efficiency below requirements (3.7.b.7) Parking brake: efficiency below requirements (3.7.b.7) 24 January 2011 [12:05] 24/01/2011 447134721074 447134721074

MOT TEST: 11 February 2013 17:34:51 PASSED
MOT TEST: 11 February 2013 17:34:51 PASSED

This test (178302643019) was completed on the 11 February 2013 17:34:51 and PASSED the requirements for a valid MOT with 0 comments.

This test (178302643019) was completed on the 11 February 2013 17:34:51 and PASSED the requirements for a valid MOT with 0 comments.

Recorded mileage: 95,125

Recorded mileage: 95,125


MOT TEST: 14 January 2012 10:43:39 PASSED
MOT TEST: 14 January 2012 10:43:39 PASSED

This test (398194912086) was completed on the 14 January 2012 10:43:39 and PASSED the requirements for a valid MOT with 0 comments.

This test (398194912086) was completed on the 14 January 2012 10:43:39 and PASSED the requirements for a valid MOT with 0 comments.

Recorded mileage: 95,114

Recorded mileage: 95,114


MOT TEST: 04 February 2011 08:24:36 PASSED
MOT TEST: 04 February 2011 08:24:36 PASSED

This test (118295531478) was completed on the 04 February 2011 08:24:36 and PASSED the requirements for a valid MOT with 0 comments.

This test (118295531478) was completed on the 04 February 2011 08:24:36 and PASSED the requirements for a valid MOT with 0 comments.

Recorded mileage: 95,110

Recorded mileage: 95,110


MOT TEST: 24 January 2011 12:05:04 FAILED
MOT TEST: 24 January 2011 12:05:04 FAILED

This test (447134721074) was completed on the 24 January 2011 12:05:04 and FAILED the requirements for a valid MOT with 8 comments.

This test (447134721074) was completed on the 24 January 2011 12:05:04 and FAILED the requirements for a valid MOT with 8 comments.

Recorded mileage: 95,110

Recorded mileage: 95,110


FAIL