863 UXK


863UXK is registered to a Grey 1971, Morris Minor 1000 with a Petrol engine. It Failed its most recent MOT Test on the 14 August 2014

21 unique faults (25 Total) reported in its MOT History (12 Tests).

4 common/recurring faults, the most frequent (2 times) is: Indicator tell tale inoperative (1.4.A.2a).

50% (6) MOT Pass Rate and a 50% (6) MOT Failure Rate.

83,288 recorded miles.

863 UXK


863UXK is registered to a Grey 1971, Morris Minor 1000 with a Petrol engine. It Failed its most recent MOT Test on the 14 August 2014

21 unique faults (25 Total) reported in its MOT History (12 Tests).

4 common/recurring faults, the most frequent (2 times) is: Indicator tell tale inoperative (1.4.A.2a).

50% (6) MOT Pass Rate and a 50% (6) MOT Failure Rate.

83,288 recorded miles.

MOT PASS/Failure rate for 863 UXK

all MOT test results for 863 UXK represented as a percentage
MOT PASS/Failure rate for 863 UXK
all MOT test results for 863 UXK represented as a percentage

PERCENTAGE OF VEHICLE FAULTS WITH 863 UXK

ALL REPORTED FAULTS, DISPLAYED BY PERCENTAGE OF OCCURRENCE DURING ALL MOT TESTS
PERCENTAGE OF VEHICLE FAULTS WITH 863 UXK
ALL REPORTED FAULTS, DISPLAYED BY PERCENTAGE OF OCCURRENCE DURING ALL MOT TESTS
ADVISORY

FAIL

USER ENTERED

863 UXK annual Faults by type

ALL REPORTED FAULTS, DISPLAYED over time and categorised by type
863 UXK annual Faults by type
ALL REPORTED FAULTS, DISPLAYED over time and categorised by type

RECURRING FAULTS WITH 863 UXK

FAULTS THAT HAVE OCCURED MORE THAN ONCE DURING 863 UXK's MOT HISTORY
RECURRING FAULTS WITH 863 UXK
FAULTS THAT HAVE OCCURED MORE THAN ONCE DURING 863 UXK's MOT HISTORY
Fault Fault Test Date Test Date/Time Reference MOT Test Reference
2 Indicator tell tale inoperative (1.4.a.2a) Indicator tell tale inoperative (1.4.a.2a) 18 December 2013 [13:08] 18/12/2013 26 March 2008 [14:10] 26/03/2008 407822653371 407822653371 554226788069 554226788069
2 Nearside lower front suspension has slight movement at a wishbone pin or bush (2.5.a.1c) Nearside lower front suspension has slight movement at a wishbone pin or bush (2.5.a.1c) 26 March 2008 [18:44] 26/03/2008 26 March 2008 [14:10] 26/03/2008 793736788020 793736788020 554226788069 554226788069
2 Nearside headlamp not in good working order but not adversely affecting beam image (1.2.4a) Nearside headlamp not in good working order but not adversely affecting beam image (1.2.4a) 26 March 2008 [18:44] 26/03/2008 26 March 2008 [14:10] 26/03/2008 793736788020 793736788020 554226788069 554226788069
2 Nearside front shock absorber has a light misting of oil (2.7.3) Nearside front shock absorber has a light misting of oil (2.7.3) 26 March 2008 [18:44] 26/03/2008 26 March 2008 [14:10] 26/03/2008 793736788020 793736788020 554226788069 554226788069

ALL 863 UXK ADVISORIES [7]

ALL ADVISORIES, ORDERED by OCCURRENCE DURING 863 UXK's MOT HISTORY
ALL 863 UXK ADVISORIES [7]
ALL ADVISORIES, ORDERED by OCCURRENCE DURING 863 UXK's MOT HISTORY
Advisory Faults | source www.vehiclestats.co.uk
Fault Fault Test Date Test Date/Time Reference MOT Test Reference
2 Nearside lower front suspension has slight movement at a wishbone pin or bush (2.5.a.1c) Nearside lower front suspension has slight movement at a wishbone pin or bush (2.5.a.1c) 26 March 2008 [18:44] 26/03/2008 26 March 2008 [14:10] 26/03/2008 793736788020 793736788020 554226788069 554226788069
2 Nearside headlamp not in good working order but not adversely affecting beam image (1.2.4a) Nearside headlamp not in good working order but not adversely affecting beam image (1.2.4a) 26 March 2008 [18:44] 26/03/2008 26 March 2008 [14:10] 26/03/2008 793736788020 793736788020 554226788069 554226788069
2 Nearside front shock absorber has a light misting of oil (2.7.3) Nearside front shock absorber has a light misting of oil (2.7.3) 26 March 2008 [18:44] 26/03/2008 26 March 2008 [14:10] 26/03/2008 793736788020 793736788020 554226788069 554226788069
1 Nearside rear shock absorber has a light misting of oil (2.7.3) Nearside rear shock absorber has a light misting of oil (2.7.3) 18 December 2013 [13:08] 18/12/2013 407822653371 407822653371

ALL 863 UXK Failure Faults [16]

ALL Failure faults, ORDERED by OCCURRENCE DURING 863 UXK's MOT HISTORY
ALL 863 UXK Failure Faults [16]
ALL Failure faults, ORDERED by OCCURRENCE DURING 863 UXK's MOT HISTORY
Fail Faults | source www.vehiclestats.co.uk
Fault Fault Test Date Test Date/Time Reference MOT Test Reference
2 Indicator tell tale inoperative (1.4.a.2a) Indicator tell tale inoperative (1.4.a.2a) 18 December 2013 [13:08] 18/12/2013 26 March 2008 [14:10] 26/03/2008 407822653371 407822653371 554226788069 554226788069
1 Horn not working (1.6.2a) Horn not working (1.6.2a) 13 August 2014 [08:36] 13/08/2014 586055824276 586055824276
1 Nearside windscreen wiper does not clear the windscreen effectively (8.2.2) Nearside windscreen wiper does not clear the windscreen effectively (8.2.2) 18 December 2013 [13:08] 18/12/2013 407822653371 407822653371
1 Offside windscreen wiper does not clear the windscreen effectively (8.2.2) Offside windscreen wiper does not clear the windscreen effectively (8.2.2) 18 December 2013 [13:08] 18/12/2013 407822653371 407822653371
1 Rear fuel pipe leaking (7.2.3) Rear fuel pipe leaking (7.2.3) 18 December 2013 [13:08] 18/12/2013 407822653371 407822653371
1 Nearside windscreen washer provides insufficient washer liquid (8.2.3) Nearside windscreen washer provides insufficient washer liquid (8.2.3) 27 March 2009 [11:47] 27/03/2009 363026989084 363026989084
1 Nearside front shock absorber has a serious fluid leak (2.7.3) Nearside front shock absorber has a serious fluid leak (2.7.3) 27 March 2009 [11:47] 27/03/2009 363026989084 363026989084
1 Offside rear rear wheel bearing rough when rotated (2.6.1) Offside rear rear wheel bearing rough when rotated (2.6.1) 27 March 2009 [11:47] 27/03/2009 363026989084 363026989084
1 Steering wheel retaining device insecure (2.1.6) Steering wheel retaining device insecure (2.1.6) 27 March 2009 [11:47] 27/03/2009 363026989084 363026989084
1 Offside front steering pivot point has excessive play (2.2.b.1g) Offside front steering pivot point has excessive play (2.2.b.1g) 27 March 2009 [11:47] 27/03/2009 363026989084 363026989084
1 Front exhaust has a major leak of exhaust gases (7.1.2) Front exhaust has a major leak of exhaust gases (7.1.2) 26 March 2008 [14:10] 26/03/2008 554226788069 554226788069
1 Brakes imbalanced across an axle (3.7.b.5b) Brakes imbalanced across an axle (3.7.b.5b) 29 August 2006 [13:09] 29/08/2006 493651346270 493651346270
1 Rear brake hose leaking (3.6.a.1) Rear brake hose leaking (3.6.a.1) 15 July 2005 [11:02] 15/07/2005 294586195135 294586195135
1 Nearside front brake hose bulging under pressure (3.6.b.3) Nearside front brake hose bulging under pressure (3.6.b.3) 15 July 2005 [11:02] 15/07/2005 294586195135 294586195135
1 Offside upper tie bar/rod rubber bush deteriorated resulting in excessive movement (2.4.g.2) Offside upper tie bar/rod rubber bush deteriorated resulting in excessive movement (2.4.g.2) 15 July 2005 [11:02] 15/07/2005 294586195135 294586195135

ALL 863 UXK User Entered Faults [2]

ALL User Entered faults, ORDERED by OCCURRENCE DURING 863 UXK's MOT HISTORY
ALL 863 UXK User Entered Faults [2]
ALL User Entered faults, ORDERED by OCCURRENCE DURING 863 UXK's MOT HISTORY
Fail Faults | source www.vehiclestats.co.uk
Fault Fault Test Date Test Date/Time Reference MOT Test Reference
1 O/s/r back plate oil soaked O/s/r back plate oil soaked 18 December 2013 [13:08] 18/12/2013 407822653371 407822653371
1 Rear spring shakle rubers starting to split Rear spring shakle rubers starting to split 27 March 2009 [11:47] 27/03/2009 363026989084 363026989084

MOT TEST: 14 August 2014 12:49:16 PASSED
MOT TEST: 14 August 2014 12:49:16 PASSED

This test (908186224248) was completed on the 14 August 2014 12:49:16 and PASSED the requirements for a valid MOT with 0 comments.

This test (908186224248) was completed on the 14 August 2014 12:49:16 and PASSED the requirements for a valid MOT with 0 comments.

Recorded mileage: 354

Recorded mileage: 354


MOT TEST: 13 August 2014 08:36:59 FAILED
MOT TEST: 13 August 2014 08:36:59 FAILED

This test (586055824276) was completed on the 13 August 2014 08:36:59 and FAILED the requirements for a valid MOT with 1 comments.

This test (586055824276) was completed on the 13 August 2014 08:36:59 and FAILED the requirements for a valid MOT with 1 comments.

Recorded mileage: 354

Recorded mileage: 354


FAIL


MOT TEST: 19 December 2013 14:47:50 PASSED
MOT TEST: 19 December 2013 14:47:50 PASSED

This test (725073353375) was completed on the 19 December 2013 14:47:50 and PASSED the requirements for a valid MOT with 0 comments.

This test (725073353375) was completed on the 19 December 2013 14:47:50 and PASSED the requirements for a valid MOT with 0 comments.

Recorded mileage: 10

Recorded mileage: 10


MOT TEST: 18 December 2013 13:08:38 FAILED
MOT TEST: 18 December 2013 13:08:38 FAILED

This test (407822653371) was completed on the 18 December 2013 13:08:38 and FAILED the requirements for a valid MOT with 6 comments.

This test (407822653371) was completed on the 18 December 2013 13:08:38 and FAILED the requirements for a valid MOT with 6 comments.

Recorded mileage: 10

Recorded mileage: 10


ADVISORY

FAIL

USER ENTERED


MOT TEST: 02 April 2009 14:09:26 PASSED
MOT TEST: 02 April 2009 14:09:26 PASSED

This test (224962299007) was completed on the 02 April 2009 14:09:26 and PASSED the requirements for a valid MOT with 0 comments.

This test (224962299007) was completed on the 02 April 2009 14:09:26 and PASSED the requirements for a valid MOT with 0 comments.

Recorded mileage: 83,288

Recorded mileage: 83,288


MOT TEST: 27 March 2009 11:47:53 FAILED
MOT TEST: 27 March 2009 11:47:53 FAILED

This test (363026989084) was completed on the 27 March 2009 11:47:53 and FAILED the requirements for a valid MOT with 6 comments.

This test (363026989084) was completed on the 27 March 2009 11:47:53 and FAILED the requirements for a valid MOT with 6 comments.

Recorded mileage: 83,254

Recorded mileage: 83,254


FAIL

USER ENTERED


MOT TEST: 26 March 2008 18:44:26 PASSED
MOT TEST: 26 March 2008 18:44:26 PASSED

This test (793736788020) was completed on the 26 March 2008 18:44:26 and PASSED the requirements for a valid MOT with 3 comments.

This test (793736788020) was completed on the 26 March 2008 18:44:26 and PASSED the requirements for a valid MOT with 3 comments.

Recorded mileage: 81,885

Recorded mileage: 81,885


ADVISORY


MOT TEST: 26 March 2008 14:10:26 FAILED
MOT TEST: 26 March 2008 14:10:26 FAILED

This test (554226788069) was completed on the 26 March 2008 14:10:26 and FAILED the requirements for a valid MOT with 5 comments.

This test (554226788069) was completed on the 26 March 2008 14:10:26 and FAILED the requirements for a valid MOT with 5 comments.

Recorded mileage: 81,885

Recorded mileage: 81,885


ADVISORY

FAIL


MOT TEST: 29 August 2006 13:38:01 PASSED
MOT TEST: 29 August 2006 13:38:01 PASSED

This test (620961846208) was completed on the 29 August 2006 13:38:01 and PASSED the requirements for a valid MOT with 0 comments.

This test (620961846208) was completed on the 29 August 2006 13:38:01 and PASSED the requirements for a valid MOT with 0 comments.

Recorded mileage: 78,973

Recorded mileage: 78,973


MOT TEST: 29 August 2006 13:09:51 FAILED
MOT TEST: 29 August 2006 13:09:51 FAILED

This test (493651346270) was completed on the 29 August 2006 13:09:51 and FAILED the requirements for a valid MOT with 1 comments.

This test (493651346270) was completed on the 29 August 2006 13:09:51 and FAILED the requirements for a valid MOT with 1 comments.

Recorded mileage: 78,973

Recorded mileage: 78,973


FAIL


MOT TEST: 15 July 2005 16:10:15 PASSED
MOT TEST: 15 July 2005 16:10:15 PASSED

This test (223886295403) was completed on the 15 July 2005 16:10:15 and PASSED the requirements for a valid MOT with 0 comments.

This test (223886295403) was completed on the 15 July 2005 16:10:15 and PASSED the requirements for a valid MOT with 0 comments.

Recorded mileage: 78,358

Recorded mileage: 78,358


MOT TEST: 15 July 2005 11:02:36 FAILED
MOT TEST: 15 July 2005 11:02:36 FAILED

This test (294586195135) was completed on the 15 July 2005 11:02:36 and FAILED the requirements for a valid MOT with 3 comments.

This test (294586195135) was completed on the 15 July 2005 11:02:36 and FAILED the requirements for a valid MOT with 3 comments.

Recorded mileage: 78,358

Recorded mileage: 78,358


FAIL