865 HOK


865HOK is registered to a Green 1963, Morris Minor 1000 with a Petrol engine. It Failed its most recent MOT Test on the 05 August 2014

12 unique faults (12 Total) reported in its MOT History (9 Tests).

0 common/recurring faults.

67% (6) MOT Pass Rate and a 33% (3) MOT Failure Rate.

76,528 recorded miles.

865 HOK


865HOK is registered to a Green 1963, Morris Minor 1000 with a Petrol engine. It Failed its most recent MOT Test on the 05 August 2014

12 unique faults (12 Total) reported in its MOT History (9 Tests).

0 common/recurring faults.

67% (6) MOT Pass Rate and a 33% (3) MOT Failure Rate.

76,528 recorded miles.

MOT PASS/Failure rate for 865 HOK

all MOT test results for 865 HOK represented as a percentage
MOT PASS/Failure rate for 865 HOK
all MOT test results for 865 HOK represented as a percentage

PERCENTAGE OF VEHICLE FAULTS WITH 865 HOK

ALL REPORTED FAULTS, DISPLAYED BY PERCENTAGE OF OCCURRENCE DURING ALL MOT TESTS
PERCENTAGE OF VEHICLE FAULTS WITH 865 HOK
ALL REPORTED FAULTS, DISPLAYED BY PERCENTAGE OF OCCURRENCE DURING ALL MOT TESTS
ADVISORY

FAIL

865 HOK annual Faults by type

ALL REPORTED FAULTS, DISPLAYED over time and categorised by type
865 HOK annual Faults by type
ALL REPORTED FAULTS, DISPLAYED over time and categorised by type

ALL 865 HOK ADVISORIES [2]

ALL ADVISORIES, ORDERED by OCCURRENCE DURING 865 HOK's MOT HISTORY
ALL 865 HOK ADVISORIES [2]
ALL ADVISORIES, ORDERED by OCCURRENCE DURING 865 HOK's MOT HISTORY
Fail Faults | source www.vehiclestats.co.uk
Fault Fault Test Date Test Date/Time Reference MOT Test Reference
1 Nearside track rod end ball joint has slight play (2.2.b.1f) Nearside track rod end ball joint has slight play (2.2.b.1f) 18 September 2007 [11:07] 18/09/2007 313451667419 313451667419
1 Offside track rod end ball joint has slight play (2.2.b.1f) Offside track rod end ball joint has slight play (2.2.b.1f) 18 September 2007 [11:07] 18/09/2007 313451667419 313451667419

ALL 865 HOK Failure Faults [10]

ALL Failure faults, ORDERED by OCCURRENCE DURING 865 HOK's MOT HISTORY
ALL 865 HOK Failure Faults [10]
ALL Failure faults, ORDERED by OCCURRENCE DURING 865 HOK's MOT HISTORY
Fail Faults | source www.vehiclestats.co.uk
Fault Fault Test Date Test Date/Time Reference MOT Test Reference
1 Brakes imbalanced across an axle (3.7.b.5b) Brakes imbalanced across an axle (3.7.b.5b) 02 August 2014 [11:28] 02/08/2014 597724914228 597724914228
1 Nearside seat belt anchorage prescribed area is excessively corroded (5.2.6) Nearside seat belt anchorage prescribed area is excessively corroded (5.2.6) 02 August 2014 [11:28] 02/08/2014 597724914228 597724914228
1 Offside front suspension spring mounting prescribed area is excessively corroded (2.4.a.3) Offside front suspension spring mounting prescribed area is excessively corroded (2.4.a.3) 16 July 2011 [09:38] 16/07/2011 755827791102 755827791102
1 Front windscreen washer provides insufficient washer liquid (8.2.3) Front windscreen washer provides insufficient washer liquid (8.2.3) 18 September 2007 [11:07] 18/09/2007 313451667419 313451667419
1 Steering column retaining device insecure (2.1.6) Steering column retaining device insecure (2.1.6) 18 September 2007 [11:07] 18/09/2007 313451667419 313451667419
1 Nearside headlamp not working on main beam (1.7.5a) Nearside headlamp not working on main beam (1.7.5a) 18 September 2007 [11:07] 18/09/2007 313451667419 313451667419
1 Nearside rear position lamp(s) excessively deteriorated so that it is not visible from a reasonable distance (1.1.a.3d) Nearside rear position lamp(s) excessively deteriorated so that it is not visible from a reasonable distance (1.1.a.3d) 18 September 2007 [11:07] 18/09/2007 313451667419 313451667419
1 Nearside front body or chassis has excessive corrosion, seriously affecting its strength within 30cm of the body mountings (6.1.b.2) Nearside front body or chassis has excessive corrosion, seriously affecting its strength within 30cm of the body mountings (6.1.b.2) 18 September 2007 [11:07] 18/09/2007 313451667419 313451667419
1 Nearside rear suspension spring mounting prescribed area is excessively corroded (2.4.a.3) Nearside rear suspension spring mounting prescribed area is excessively corroded (2.4.a.3) 18 September 2007 [11:07] 18/09/2007 313451667419 313451667419
1 Offside rear suspension spring mounting prescribed area is excessively corroded (2.4.a.3) Offside rear suspension spring mounting prescribed area is excessively corroded (2.4.a.3) 18 September 2007 [11:07] 18/09/2007 313451667419 313451667419

MOT TEST: 05 August 2014 08:56:07 PASSED
MOT TEST: 05 August 2014 08:56:07 PASSED

This test (389447414475) was completed on the 05 August 2014 08:56:07 and PASSED the requirements for a valid MOT with 0 comments.

This test (389447414475) was completed on the 05 August 2014 08:56:07 and PASSED the requirements for a valid MOT with 0 comments.

Recorded mileage: 76,513

Recorded mileage: 76,513


MOT TEST: 02 August 2014 11:28:03 FAILED
MOT TEST: 02 August 2014 11:28:03 FAILED

This test (597724914228) was completed on the 02 August 2014 11:28:03 and FAILED the requirements for a valid MOT with 2 comments.

This test (597724914228) was completed on the 02 August 2014 11:28:03 and FAILED the requirements for a valid MOT with 2 comments.

Recorded mileage: 76,513

Recorded mileage: 76,513


FAIL


MOT TEST: 15 September 2012 11:26:15 PASSED
MOT TEST: 15 September 2012 11:26:15 PASSED

This test (975659052264) was completed on the 15 September 2012 11:26:15 and PASSED the requirements for a valid MOT with 0 comments.

This test (975659052264) was completed on the 15 September 2012 11:26:15 and PASSED the requirements for a valid MOT with 0 comments.

Recorded mileage: 76,528

Recorded mileage: 76,528


MOT TEST: 10 August 2011 15:37:32 PASSED
MOT TEST: 10 August 2011 15:37:32 PASSED

This test (386562821423) was completed on the 10 August 2011 15:37:32 and PASSED the requirements for a valid MOT with 0 comments.

This test (386562821423) was completed on the 10 August 2011 15:37:32 and PASSED the requirements for a valid MOT with 0 comments.

Recorded mileage: 76,503

Recorded mileage: 76,503


MOT TEST: 16 July 2011 09:38:54 FAILED
MOT TEST: 16 July 2011 09:38:54 FAILED

This test (755827791102) was completed on the 16 July 2011 09:38:54 and FAILED the requirements for a valid MOT with 1 comments.

This test (755827791102) was completed on the 16 July 2011 09:38:54 and FAILED the requirements for a valid MOT with 1 comments.

Recorded mileage: 76,449

Recorded mileage: 76,449


FAIL


MOT TEST: 10 July 2010 09:28:12 PASSED
MOT TEST: 10 July 2010 09:28:12 PASSED

This test (470891790177) was completed on the 10 July 2010 09:28:12 and PASSED the requirements for a valid MOT with 0 comments.

This test (470891790177) was completed on the 10 July 2010 09:28:12 and PASSED the requirements for a valid MOT with 0 comments.

Recorded mileage: 76,377

Recorded mileage: 76,377


MOT TEST: 11 July 2009 11:34:02 PASSED
MOT TEST: 11 July 2009 11:34:02 PASSED

This test (890102199144) was completed on the 11 July 2009 11:34:02 and PASSED the requirements for a valid MOT with 0 comments.

This test (890102199144) was completed on the 11 July 2009 11:34:02 and PASSED the requirements for a valid MOT with 0 comments.

Recorded mileage: 76,326

Recorded mileage: 76,326


MOT TEST: 04 July 2008 08:51:34 PASSED
MOT TEST: 04 July 2008 08:51:34 PASSED

This test (212226888139) was completed on the 04 July 2008 08:51:34 and PASSED the requirements for a valid MOT with 0 comments.

This test (212226888139) was completed on the 04 July 2008 08:51:34 and PASSED the requirements for a valid MOT with 0 comments.

Recorded mileage: 76,274

Recorded mileage: 76,274


MOT TEST: 18 September 2007 11:07:02 FAILED
MOT TEST: 18 September 2007 11:07:02 FAILED

This test (313451667419) was completed on the 18 September 2007 11:07:02 and FAILED the requirements for a valid MOT with 9 comments.

This test (313451667419) was completed on the 18 September 2007 11:07:02 and FAILED the requirements for a valid MOT with 9 comments.

Recorded mileage: 76,203

Recorded mileage: 76,203


ADVISORY

FAIL