870 4SF


8704SF is registered to a Grey 1962, Morris with a Petrol engine. It Passed its most recent MOT Test on the 28 February 2019

13 unique faults (13 Total) reported in its MOT History (4 Tests).

0 common/recurring faults.

75% (3) MOT Pass Rate and a 25% (1) MOT Failure Rate.

69,673 recorded miles.

870 4SF


8704SF is registered to a Grey 1962, Morris with a Petrol engine. It Passed its most recent MOT Test on the 28 February 2019

13 unique faults (13 Total) reported in its MOT History (4 Tests).

0 common/recurring faults.

75% (3) MOT Pass Rate and a 25% (1) MOT Failure Rate.

69,673 recorded miles.

MOT PASS/Failure rate for 870 4SF

all MOT test results for 870 4SF represented as a percentage
MOT PASS/Failure rate for 870 4SF
all MOT test results for 870 4SF represented as a percentage

PERCENTAGE OF VEHICLE FAULTS WITH 870 4SF

ALL REPORTED FAULTS, DISPLAYED BY PERCENTAGE OF OCCURRENCE DURING ALL MOT TESTS
PERCENTAGE OF VEHICLE FAULTS WITH 870 4SF
ALL REPORTED FAULTS, DISPLAYED BY PERCENTAGE OF OCCURRENCE DURING ALL MOT TESTS
ADVISORY

FAIL

USER ENTERED

MINOR

870 4SF annual Faults by type

ALL REPORTED FAULTS, DISPLAYED over time and categorised by type
870 4SF annual Faults by type
ALL REPORTED FAULTS, DISPLAYED over time and categorised by type

ALL 870 4SF ADVISORIES [3]

ALL ADVISORIES, ORDERED by OCCURRENCE DURING 870 4SF's MOT HISTORY
ALL 870 4SF ADVISORIES [3]
ALL ADVISORIES, ORDERED by OCCURRENCE DURING 870 4SF's MOT HISTORY
Minor Faults | source www.vehiclestats.co.uk
Fault Fault Test Date Test Date/Time Reference MOT Test Reference
1 Offside front wheel bearing has slight play (5.1.3 (a) (i)) Offside front wheel bearing has slight play (5.1.3 (a) (i)) 26 February 2019 [13:35] 26/02/2019 802164024852 802164024852
1 Oil leak, but not excessive from engine (8.4.1 (a) (i)) Oil leak, but not excessive from engine (8.4.1 (a) (i)) 26 February 2019 [13:35] 26/02/2019 802164024852 802164024852
1 Oil leak, but not excessive from transmittion (8.4.1 (a) (i)) Oil leak, but not excessive from transmittion (8.4.1 (a) (i)) 26 February 2019 [13:35] 26/02/2019 802164024852 802164024852

ALL 870 4SF Failure Faults [6]

ALL Failure faults, ORDERED by OCCURRENCE DURING 870 4SF's MOT HISTORY
ALL 870 4SF Failure Faults [6]
ALL Failure faults, ORDERED by OCCURRENCE DURING 870 4SF's MOT HISTORY
Minor Faults | source www.vehiclestats.co.uk
Fault Fault Test Date Test Date/Time Reference MOT Test Reference
1 Horn not working (7.7 (a) (ii)) Horn not working (7.7 (a) (ii)) 26 February 2019 [13:35] 26/02/2019 802164024852 802164024852
1 Nearside front windscreen washer provides insufficient washer liquid (3.5 (a)) Nearside front windscreen washer provides insufficient washer liquid (3.5 (a)) 26 February 2019 [13:35] 26/02/2019 802164024852 802164024852
1 Nearside front integral body structure or chassis has excessive corrosion, seriously affecting its strength within 30cm of a body mounting front sile (6.2.2 (d) (i)) Nearside front integral body structure or chassis has excessive corrosion, seriously affecting its strength within 30cm of a body mounting front sile (6.2.2 (d) (i)) 26 February 2019 [13:35] 26/02/2019 802164024852 802164024852
1 Offside front integral body structure or chassis has excessive corrosion, seriously affecting its strength within 30cm of a body mounting front sile (6.2.2 (d) (i)) Offside front integral body structure or chassis has excessive corrosion, seriously affecting its strength within 30cm of a body mounting front sile (6.2.2 (d) (i)) 26 February 2019 [13:35] 26/02/2019 802164024852 802164024852
1 Nearside front integral body structure or chassis has excessive corrosion, seriously affecting its strength within 30cm of a body mounting wheel arch (6.2.2 (d) (i)) Nearside front integral body structure or chassis has excessive corrosion, seriously affecting its strength within 30cm of a body mounting wheel arch (6.2.2 (d) (i)) 26 February 2019 [13:35] 26/02/2019 802164024852 802164024852
1 Offside front integral body structure or chassis has excessive corrosion, seriously affecting its strength within 30cm of a body mounting wheel arch (6.2.2 (d) (i)) Offside front integral body structure or chassis has excessive corrosion, seriously affecting its strength within 30cm of a body mounting wheel arch (6.2.2 (d) (i)) 26 February 2019 [13:35] 26/02/2019 802164024852 802164024852

ALL 870 4SF minor Faults [1]

ALL minor faults, ORDERED by OCCURRENCE DURING 870 4SF's MOT HISTORY
ALL 870 4SF minor Faults [1]
ALL minor faults, ORDERED by OCCURRENCE DURING 870 4SF's MOT HISTORY
Minor Faults | source www.vehiclestats.co.uk
Fault Fault Test Date Test Date/Time Reference MOT Test Reference
1 Indicator tell-tale inoperative on indicator stock (4.9.1 (a) (i)) Indicator tell-tale inoperative on indicator stock (4.9.1 (a) (i)) 26 February 2019 [13:35] 26/02/2019 802164024852 802164024852

ALL 870 4SF User Entered Faults [3]

ALL User Entered faults, ORDERED by OCCURRENCE DURING 870 4SF's MOT HISTORY
ALL 870 4SF User Entered Faults [3]
ALL User Entered faults, ORDERED by OCCURRENCE DURING 870 4SF's MOT HISTORY
User Entered Faults | source www.vehiclestats.co.uk
Fault Fault Test Date Test Date/Time Reference MOT Test Reference
1 All under body coverd in sealer All under body coverd in sealer 29 April 2014 [17:18] 29/04/2014 555729414169 555729414169
1 2x o/s tyres starting to split 2x o/s tyres starting to split 29 April 2014 [17:18] 29/04/2014 555729414169 555729414169
1 2x trackrod ends have slight play 2x trackrod ends have slight play 29 April 2014 [17:18] 29/04/2014 555729414169 555729414169

MOT TEST: 28 February 2019 17:24:06 PASSED
MOT TEST: 28 February 2019 17:24:06 PASSED

This test (548008300752) was completed on the 28 February 2019 17:24:06 and PASSED the requirements for a valid MOT with 0 comments.

This test (548008300752) was completed on the 28 February 2019 17:24:06 and PASSED the requirements for a valid MOT with 0 comments.

Recorded mileage: 69,673

Recorded mileage: 69,673


MOT TEST: 26 February 2019 13:35:55 FAILED
MOT TEST: 26 February 2019 13:35:55 FAILED

This test (802164024852) was completed on the 26 February 2019 13:35:55 and FAILED the requirements for a valid MOT with 10 comments.

This test (802164024852) was completed on the 26 February 2019 13:35:55 and FAILED the requirements for a valid MOT with 10 comments.

Recorded mileage: 69,673

Recorded mileage: 69,673


ADVISORY

FAIL

MINOR


MOT TEST: 29 April 2014 17:18:13 PASSED
MOT TEST: 29 April 2014 17:18:13 PASSED

This test (555729414169) was completed on the 29 April 2014 17:18:13 and PASSED the requirements for a valid MOT with 3 comments.

This test (555729414169) was completed on the 29 April 2014 17:18:13 and PASSED the requirements for a valid MOT with 3 comments.

Recorded mileage: 69,634

Recorded mileage: 69,634


USER ENTERED


MOT TEST: 26 April 2013 22:06:15 PASSED
MOT TEST: 26 April 2013 22:06:15 PASSED

This test (375546313162) was completed on the 26 April 2013 22:06:15 and PASSED the requirements for a valid MOT with 0 comments.

This test (375546313162) was completed on the 26 April 2013 22:06:15 and PASSED the requirements for a valid MOT with 0 comments.

Recorded mileage: 69,605

Recorded mileage: 69,605