870 YHK


870YHK is registered to a Grey 1961, Morris 1000 saloon with a Petrol engine. It Failed its most recent MOT Test on the 11 April 2018

12 unique faults (13 Total) reported in its MOT History (16 Tests).

1 common/recurring faults.

75% (12) MOT Pass Rate and a 25% (4) MOT Failure Rate.

17,807 recorded miles.

870 YHK


870YHK is registered to a Grey 1961, Morris 1000 saloon with a Petrol engine. It Failed its most recent MOT Test on the 11 April 2018

12 unique faults (13 Total) reported in its MOT History (16 Tests).

1 common/recurring faults.

75% (12) MOT Pass Rate and a 25% (4) MOT Failure Rate.

17,807 recorded miles.

MOT PASS/Failure rate for 870 YHK

all MOT test results for 870 YHK represented as a percentage
MOT PASS/Failure rate for 870 YHK
all MOT test results for 870 YHK represented as a percentage

PERCENTAGE OF VEHICLE FAULTS WITH 870 YHK

ALL REPORTED FAULTS, DISPLAYED BY PERCENTAGE OF OCCURRENCE DURING ALL MOT TESTS
PERCENTAGE OF VEHICLE FAULTS WITH 870 YHK
ALL REPORTED FAULTS, DISPLAYED BY PERCENTAGE OF OCCURRENCE DURING ALL MOT TESTS
ADVISORY

FAIL

USER ENTERED

PASS WITH RECTIFICATION

870 YHK annual Faults by type

ALL REPORTED FAULTS, DISPLAYED over time and categorised by type
870 YHK annual Faults by type
ALL REPORTED FAULTS, DISPLAYED over time and categorised by type

ALL 870 YHK ADVISORIES [1]

ALL ADVISORIES, ORDERED by OCCURRENCE DURING 870 YHK's MOT HISTORY
ALL 870 YHK ADVISORIES [1]
ALL ADVISORIES, ORDERED by OCCURRENCE DURING 870 YHK's MOT HISTORY
Advisory Faults | source www.vehiclestats.co.uk
Fault Fault Test Date Test Date/Time Reference MOT Test Reference
1 Nearside front wheel bearing has slight play (2.5.a.3c) Nearside front wheel bearing has slight play (2.5.a.3c) 12 April 2017 [09:13] 12/04/2017 654717372011 654717372011

ALL 870 YHK Failure Faults [7]

ALL Failure faults, ORDERED by OCCURRENCE DURING 870 YHK's MOT HISTORY
ALL 870 YHK Failure Faults [7]
ALL Failure faults, ORDERED by OCCURRENCE DURING 870 YHK's MOT HISTORY
Fail Faults | source www.vehiclestats.co.uk
Fault Fault Test Date Test Date/Time Reference MOT Test Reference
1 Offside rear suspension spring mounting prescribed area is excessively corroded (2.4.a.3) Offside rear suspension spring mounting prescribed area is excessively corroded (2.4.a.3) 19 June 2007 [09:12] 19/06/2007 233380977167 233380977167
1 Nearside rear braking system leaking (3.6.a.1) Nearside rear braking system leaking (3.6.a.1) 19 June 2007 [09:12] 19/06/2007 233380977167 233380977167
1 Nearside headlamp not working on dipped beam (1.7.5a) Nearside headlamp not working on dipped beam (1.7.5a) 12 June 2006 [16:16] 12/06/2006 224463666180 224463666180
1 Offside headlamp not working on dipped beam (1.7.5a) Offside headlamp not working on dipped beam (1.7.5a) 12 June 2006 [16:16] 12/06/2006 224463666180 224463666180
1 Nearside front brake hose excessively deteriorated (3.6.b.4d) Nearside front brake hose excessively deteriorated (3.6.b.4d) 12 June 2006 [16:16] 12/06/2006 224463666180 224463666180
1 Nearside front braking system leaking (3.6.a.1) Nearside front braking system leaking (3.6.a.1) 12 June 2006 [16:16] 12/06/2006 224463666180 224463666180
1 Brakes imbalanced across an axle (3.7.b.5b) Brakes imbalanced across an axle (3.7.b.5b) 12 June 2006 [16:16] 12/06/2006 224463666180 224463666180

ALL 870 YHK User Entered Faults [2]

ALL User Entered faults, ORDERED by OCCURRENCE DURING 870 YHK's MOT HISTORY
ALL 870 YHK User Entered Faults [2]
ALL User Entered faults, ORDERED by OCCURRENCE DURING 870 YHK's MOT HISTORY
User Entered Faults | source www.vehiclestats.co.uk
Fault Fault Test Date Test Date/Time Reference MOT Test Reference
1 Nearside rear axle hub seal leaking Nearside rear axle hub seal leaking 20 March 2013 [15:50] 20/03/2013 125869773499 125869773499
1 Slight rear axle oil leak in nearside hub Slight rear axle oil leak in nearside hub 27 August 2008 [10:27] 27/08/2008 310980848434 310980848434

ALL 870 YHK Pass With Rectification Faults [3]

ALL Pass With Rectification faults, ORDERED by OCCURRENCE DURING 870 YHK's MOT HISTORY
ALL 870 YHK Pass With Rectification Faults [3]
ALL Pass With Rectification faults, ORDERED by OCCURRENCE DURING 870 YHK's MOT HISTORY
Pass With Rectification Faults | source www.vehiclestats.co.uk
Fault Fault Test Date Test Date/Time Reference MOT Test Reference
1 Nearside headlamp not working on dipped beam (1.7.5a) Nearside headlamp not working on dipped beam (1.7.5a) 13 April 2016 [10:11] 13/04/2016 756654118142 756654118142
1 Offside rear tyre not fitted in accordance with side wall instructions (4.1.d.1f) Offside rear tyre not fitted in accordance with side wall instructions (4.1.d.1f) 08 March 2011 [12:08] 08/03/2011 599887761022 599887761022
1 Nearside rear tyre not fitted in accordance with side wall instructions (4.1.d.1f) Nearside rear tyre not fitted in accordance with side wall instructions (4.1.d.1f) 08 March 2011 [12:08] 08/03/2011 599887761022 599887761022

MOT TEST: 11 April 2018 12:12:00 PASSED
MOT TEST: 11 April 2018 12:12:00 PASSED

This test (935336406865) was completed on the 11 April 2018 12:12:00 and PASSED the requirements for a valid MOT with 0 comments.

This test (935336406865) was completed on the 11 April 2018 12:12:00 and PASSED the requirements for a valid MOT with 0 comments.

Recorded mileage: 17,807

Recorded mileage: 17,807


MOT TEST: 12 April 2017 09:13:00 PASSED
MOT TEST: 12 April 2017 09:13:00 PASSED

This test (654717372011) was completed on the 12 April 2017 09:13:00 and PASSED the requirements for a valid MOT with 1 comments.

This test (654717372011) was completed on the 12 April 2017 09:13:00 and PASSED the requirements for a valid MOT with 1 comments.

Recorded mileage: 17,782

Recorded mileage: 17,782


ADVISORY


MOT TEST: 13 April 2016 10:11:22 PASSED
MOT TEST: 13 April 2016 10:11:22 PASSED

This test (315718369535) was completed on the 13 April 2016 10:11:22 and PASSED the requirements for a valid MOT with 0 comments.

This test (315718369535) was completed on the 13 April 2016 10:11:22 and PASSED the requirements for a valid MOT with 0 comments.

Recorded mileage: 17,234

Recorded mileage: 17,234


MOT TEST: 13 April 2016 10:11:21 FAILED
MOT TEST: 13 April 2016 10:11:21 FAILED

This test (756654118142) was completed on the 13 April 2016 10:11:21 and FAILED the requirements for a valid MOT with 1 comments.

This test (756654118142) was completed on the 13 April 2016 10:11:21 and FAILED the requirements for a valid MOT with 1 comments.

Recorded mileage: 17,234

Recorded mileage: 17,234


PASS WITH RECTIFICATION


MOT TEST: 14 April 2015 15:57:12 PASSED
MOT TEST: 14 April 2015 15:57:12 PASSED

This test (478584805182) was completed on the 14 April 2015 15:57:12 and PASSED the requirements for a valid MOT with 0 comments.

This test (478584805182) was completed on the 14 April 2015 15:57:12 and PASSED the requirements for a valid MOT with 0 comments.

Recorded mileage: 16,819

Recorded mileage: 16,819


MOT TEST: 16 April 2014 11:16:04 PASSED
MOT TEST: 16 April 2014 11:16:04 PASSED

This test (116886704157) was completed on the 16 April 2014 11:16:04 and PASSED the requirements for a valid MOT with 0 comments.

This test (116886704157) was completed on the 16 April 2014 11:16:04 and PASSED the requirements for a valid MOT with 0 comments.

Recorded mileage: 16,358

Recorded mileage: 16,358


MOT TEST: 20 March 2013 15:50:21 PASSED
MOT TEST: 20 March 2013 15:50:21 PASSED

This test (125869773499) was completed on the 20 March 2013 15:50:21 and PASSED the requirements for a valid MOT with 1 comments.

This test (125869773499) was completed on the 20 March 2013 15:50:21 and PASSED the requirements for a valid MOT with 1 comments.

Recorded mileage: 15,832

Recorded mileage: 15,832


USER ENTERED


MOT TEST: 16 March 2012 09:32:25 PASSED
MOT TEST: 16 March 2012 09:32:25 PASSED

This test (545566872097) was completed on the 16 March 2012 09:32:25 and PASSED the requirements for a valid MOT with 0 comments.

This test (545566872097) was completed on the 16 March 2012 09:32:25 and PASSED the requirements for a valid MOT with 0 comments.

Recorded mileage: 15,367

Recorded mileage: 15,367


MOT TEST: 08 March 2011 12:08:29 PASSED
MOT TEST: 08 March 2011 12:08:29 PASSED

This test (116657261087) was completed on the 08 March 2011 12:08:29 and PASSED the requirements for a valid MOT with 0 comments.

This test (116657261087) was completed on the 08 March 2011 12:08:29 and PASSED the requirements for a valid MOT with 0 comments.

Recorded mileage: 14,642

Recorded mileage: 14,642


MOT TEST: 08 March 2011 12:08:29 FAILED
MOT TEST: 08 March 2011 12:08:29 FAILED

This test (599887761022) was completed on the 08 March 2011 12:08:29 and FAILED the requirements for a valid MOT with 2 comments.

This test (599887761022) was completed on the 08 March 2011 12:08:29 and FAILED the requirements for a valid MOT with 2 comments.

Recorded mileage: 14,642

Recorded mileage: 14,642


PASS WITH RECTIFICATION


MOT TEST: 26 March 2010 10:04:36 PASSED
MOT TEST: 26 March 2010 10:04:36 PASSED

This test (243125180053) was completed on the 26 March 2010 10:04:36 and PASSED the requirements for a valid MOT with 0 comments.

This test (243125180053) was completed on the 26 March 2010 10:04:36 and PASSED the requirements for a valid MOT with 0 comments.

Recorded mileage: 14,328

Recorded mileage: 14,328


MOT TEST: 27 August 2008 10:27:30 PASSED
MOT TEST: 27 August 2008 10:27:30 PASSED

This test (310980848434) was completed on the 27 August 2008 10:27:30 and PASSED the requirements for a valid MOT with 1 comments.

This test (310980848434) was completed on the 27 August 2008 10:27:30 and PASSED the requirements for a valid MOT with 1 comments.

Recorded mileage: 14,266

Recorded mileage: 14,266


USER ENTERED


MOT TEST: 20 June 2007 09:30:50 PASSED
MOT TEST: 20 June 2007 09:30:50 PASSED

This test (910921577106) was completed on the 20 June 2007 09:30:50 and PASSED the requirements for a valid MOT with 0 comments.

This test (910921577106) was completed on the 20 June 2007 09:30:50 and PASSED the requirements for a valid MOT with 0 comments.

Recorded mileage: 14,201

Recorded mileage: 14,201


MOT TEST: 19 June 2007 09:12:16 FAILED
MOT TEST: 19 June 2007 09:12:16 FAILED

This test (233380977167) was completed on the 19 June 2007 09:12:16 and FAILED the requirements for a valid MOT with 2 comments.

This test (233380977167) was completed on the 19 June 2007 09:12:16 and FAILED the requirements for a valid MOT with 2 comments.

Recorded mileage: 14,201

Recorded mileage: 14,201


FAIL


MOT TEST: 17 June 2006 12:20:11 PASSED
MOT TEST: 17 June 2006 12:20:11 PASSED

This test (873688066147) was completed on the 17 June 2006 12:20:11 and PASSED the requirements for a valid MOT with 0 comments.

This test (873688066147) was completed on the 17 June 2006 12:20:11 and PASSED the requirements for a valid MOT with 0 comments.

Recorded mileage: 13,631

Recorded mileage: 13,631


MOT TEST: 12 June 2006 16:16:46 FAILED
MOT TEST: 12 June 2006 16:16:46 FAILED

This test (224463666180) was completed on the 12 June 2006 16:16:46 and FAILED the requirements for a valid MOT with 5 comments.

This test (224463666180) was completed on the 12 June 2006 16:16:46 and FAILED the requirements for a valid MOT with 5 comments.

Recorded mileage: 13,631

Recorded mileage: 13,631


FAIL