875 UYN


875UYN is registered to a Blue 1956, Morris 1000 with a Petrol engine. It Failed its most recent MOT Test on the 29 June 2012

15 unique faults (18 Total) reported in its MOT History (5 Tests).

3 common/recurring faults, the most frequent (2 times) is: Offside Front Lower Suspension arm has slight play in a pin/bearing (2.4.G.2).

60% (3) MOT Pass Rate and a 40% (2) MOT Failure Rate.

29,516 recorded miles.

875 UYN


875UYN is registered to a Blue 1956, Morris 1000 with a Petrol engine. It Failed its most recent MOT Test on the 29 June 2012

15 unique faults (18 Total) reported in its MOT History (5 Tests).

3 common/recurring faults, the most frequent (2 times) is: Offside Front Lower Suspension arm has slight play in a pin/bearing (2.4.G.2).

60% (3) MOT Pass Rate and a 40% (2) MOT Failure Rate.

29,516 recorded miles.

MOT PASS/Failure rate for 875 UYN

all MOT test results for 875 UYN represented as a percentage
MOT PASS/Failure rate for 875 UYN
all MOT test results for 875 UYN represented as a percentage

PERCENTAGE OF VEHICLE FAULTS WITH 875 UYN

ALL REPORTED FAULTS, DISPLAYED BY PERCENTAGE OF OCCURRENCE DURING ALL MOT TESTS
PERCENTAGE OF VEHICLE FAULTS WITH 875 UYN
ALL REPORTED FAULTS, DISPLAYED BY PERCENTAGE OF OCCURRENCE DURING ALL MOT TESTS
ADVISORY

FAIL

USER ENTERED

PASS WITH RECTIFICATION

875 UYN annual Faults by type

ALL REPORTED FAULTS, DISPLAYED over time and categorised by type
875 UYN annual Faults by type
ALL REPORTED FAULTS, DISPLAYED over time and categorised by type

RECURRING FAULTS WITH 875 UYN

FAULTS THAT HAVE OCCURED MORE THAN ONCE DURING 875 UYN's MOT HISTORY
RECURRING FAULTS WITH 875 UYN
FAULTS THAT HAVE OCCURED MORE THAN ONCE DURING 875 UYN's MOT HISTORY
Fault Fault Test Date Test Date/Time Reference MOT Test Reference
2 Offside front lower suspension arm has slight play in a pin/bearing (2.4.g.2) Offside front lower suspension arm has slight play in a pin/bearing (2.4.g.2) 29 June 2012 [11:37] 29/06/2012 28 June 2012 [10:16] 28/06/2012 466121582159 466121582159 169660582128 169660582128
2 Engine mountings sagging Engine mountings sagging 29 June 2012 [11:37] 29/06/2012 28 June 2012 [10:16] 28/06/2012 466121582159 466121582159 169660582128 169660582128
2 Wireing on flasher unit insecure Wireing on flasher unit insecure 29 June 2012 [11:37] 29/06/2012 28 June 2012 [10:16] 28/06/2012 466121582159 466121582159 169660582128 169660582128

ALL 875 UYN ADVISORIES [4]

ALL ADVISORIES, ORDERED by OCCURRENCE DURING 875 UYN's MOT HISTORY
ALL 875 UYN ADVISORIES [4]
ALL ADVISORIES, ORDERED by OCCURRENCE DURING 875 UYN's MOT HISTORY
Advisory Faults | source www.vehiclestats.co.uk
Fault Fault Test Date Test Date/Time Reference MOT Test Reference
2 Offside front lower suspension arm has slight play in a pin/bearing (2.4.g.2) Offside front lower suspension arm has slight play in a pin/bearing (2.4.g.2) 29 June 2012 [11:37] 29/06/2012 28 June 2012 [10:16] 28/06/2012 466121582159 466121582159 169660582128 169660582128
1 Nearside rear tyre worn close to the legal limit (4.1.e.1) Nearside rear tyre worn close to the legal limit (4.1.e.1) 06 May 2010 [12:00] 06/05/2010 814446920105 814446920105
1 Rear body has slight corrosion (6.1.b.2) Rear body has slight corrosion (6.1.b.2) 06 May 2010 [12:00] 06/05/2010 814446920105 814446920105

ALL 875 UYN Failure Faults [7]

ALL Failure faults, ORDERED by OCCURRENCE DURING 875 UYN's MOT HISTORY
ALL 875 UYN Failure Faults [7]
ALL Failure faults, ORDERED by OCCURRENCE DURING 875 UYN's MOT HISTORY
Pass With Rectification Faults | source www.vehiclestats.co.uk
Fault Fault Test Date Test Date/Time Reference MOT Test Reference
1 Nearside track rod end ball joint has excessive play (2.2.b.1f) Nearside track rod end ball joint has excessive play (2.2.b.1f) 28 June 2012 [10:16] 28/06/2012 169660582128 169660582128
1 Offside track rod end ball joint dust cover missing (2.2.c.1c) Offside track rod end ball joint dust cover missing (2.2.c.1c) 28 June 2012 [10:16] 28/06/2012 169660582128 169660582128
1 Offside front headlamp not working on main beam (1.7.5a) Offside front headlamp not working on main beam (1.7.5a) 24 May 2011 [10:16] 24/05/2011 405724841137 405724841137
1 Nearside front headlamp not working on dipped beam (1.7.5a) Nearside front headlamp not working on dipped beam (1.7.5a) 24 May 2011 [10:16] 24/05/2011 405724841137 405724841137
1 Offside front headlamp not working on dipped beam (1.7.5a) Offside front headlamp not working on dipped beam (1.7.5a) 24 May 2011 [10:16] 24/05/2011 405724841137 405724841137
1 Nearside rear tyre has a tear, caused by separation or partial failure of its structure (4.1.d.1b) Nearside rear tyre has a tear, caused by separation or partial failure of its structure (4.1.d.1b) 24 May 2011 [10:16] 24/05/2011 405724841137 405724841137
1 Offside rear tyre has a tear, caused by separation or partial failure of its structure (4.1.d.1b) Offside rear tyre has a tear, caused by separation or partial failure of its structure (4.1.d.1b) 24 May 2011 [10:16] 24/05/2011 405724841137 405724841137

ALL 875 UYN User Entered Faults [4]

ALL User Entered faults, ORDERED by OCCURRENCE DURING 875 UYN's MOT HISTORY
ALL 875 UYN User Entered Faults [4]
ALL User Entered faults, ORDERED by OCCURRENCE DURING 875 UYN's MOT HISTORY
Advisory Faults | source www.vehiclestats.co.uk
Fault Fault Test Date Test Date/Time Reference MOT Test Reference
2 Engine mountings sagging Engine mountings sagging 29 June 2012 [11:37] 29/06/2012 28 June 2012 [10:16] 28/06/2012 466121582159 466121582159 169660582128 169660582128
2 Wireing on flasher unit insecure Wireing on flasher unit insecure 29 June 2012 [11:37] 29/06/2012 28 June 2012 [10:16] 28/06/2012 466121582159 466121582159 169660582128 169660582128

ALL 875 UYN Pass With Rectification Faults [3]

ALL Pass With Rectification faults, ORDERED by OCCURRENCE DURING 875 UYN's MOT HISTORY
ALL 875 UYN Pass With Rectification Faults [3]
ALL Pass With Rectification faults, ORDERED by OCCURRENCE DURING 875 UYN's MOT HISTORY
Pass With Rectification Faults | source www.vehiclestats.co.uk
Fault Fault Test Date Test Date/Time Reference MOT Test Reference
1 Nearside stop lamp not working (1.2.1b) Nearside stop lamp not working (1.2.1b) 28 June 2012 [10:16] 28/06/2012 169660582128 169660582128
1 Offside windscreen wiper does not clear the windscreen effectively (8.2.2) Offside windscreen wiper does not clear the windscreen effectively (8.2.2) 28 June 2012 [10:16] 28/06/2012 169660582128 169660582128
1 Offside headlamp aim too high (1.8) Offside headlamp aim too high (1.8) 28 June 2012 [10:16] 28/06/2012 169660582128 169660582128

MOT TEST: 29 June 2012 11:37:29 PASSED
MOT TEST: 29 June 2012 11:37:29 PASSED

This test (466121582159) was completed on the 29 June 2012 11:37:29 and PASSED the requirements for a valid MOT with 3 comments.

This test (466121582159) was completed on the 29 June 2012 11:37:29 and PASSED the requirements for a valid MOT with 3 comments.

Recorded mileage: 29,516

Recorded mileage: 29,516


ADVISORY

USER ENTERED


MOT TEST: 28 June 2012 10:16:15 FAILED
MOT TEST: 28 June 2012 10:16:15 FAILED

This test (169660582128) was completed on the 28 June 2012 10:16:15 and FAILED the requirements for a valid MOT with 8 comments.

This test (169660582128) was completed on the 28 June 2012 10:16:15 and FAILED the requirements for a valid MOT with 8 comments.

Recorded mileage: 29,493

Recorded mileage: 29,493


ADVISORY

FAIL

USER ENTERED

PASS WITH RECTIFICATION


MOT TEST: 25 May 2011 12:27:43 PASSED
MOT TEST: 25 May 2011 12:27:43 PASSED

This test (366985741177) was completed on the 25 May 2011 12:27:43 and PASSED the requirements for a valid MOT with 0 comments.

This test (366985741177) was completed on the 25 May 2011 12:27:43 and PASSED the requirements for a valid MOT with 0 comments.

Recorded mileage: 28,589

Recorded mileage: 28,589


MOT TEST: 24 May 2011 10:16:07 FAILED
MOT TEST: 24 May 2011 10:16:07 FAILED

This test (405724841137) was completed on the 24 May 2011 10:16:07 and FAILED the requirements for a valid MOT with 5 comments.

This test (405724841137) was completed on the 24 May 2011 10:16:07 and FAILED the requirements for a valid MOT with 5 comments.

Recorded mileage: 28,589

Recorded mileage: 28,589


FAIL


MOT TEST: 06 May 2010 12:00:43 PASSED
MOT TEST: 06 May 2010 12:00:43 PASSED

This test (814446920105) was completed on the 06 May 2010 12:00:43 and PASSED the requirements for a valid MOT with 2 comments.

This test (814446920105) was completed on the 06 May 2010 12:00:43 and PASSED the requirements for a valid MOT with 2 comments.

Recorded mileage: 27,072

Recorded mileage: 27,072


ADVISORY