876 BYH


876BYH is registered to a Grey 1961, Morris Minor 1000 with a Petrol engine. It Passed its most recent MOT Test on the 11 April 2018

27 unique faults (39 Total) reported in its MOT History (19 Tests).

9 common/recurring faults, the most frequent (4 times) is: Nearside Front Brake pipe slightly corroded (3.6.B.2c).

74% (14) MOT Pass Rate and a 26% (5) MOT Failure Rate.

62,708 recorded miles.

876 BYH


876BYH is registered to a Grey 1961, Morris Minor 1000 with a Petrol engine. It Passed its most recent MOT Test on the 11 April 2018

27 unique faults (39 Total) reported in its MOT History (19 Tests).

9 common/recurring faults, the most frequent (4 times) is: Nearside Front Brake pipe slightly corroded (3.6.B.2c).

74% (14) MOT Pass Rate and a 26% (5) MOT Failure Rate.

62,708 recorded miles.

MOT PASS/Failure rate for 876 BYH

all MOT test results for 876 BYH represented as a percentage
MOT PASS/Failure rate for 876 BYH
all MOT test results for 876 BYH represented as a percentage

PERCENTAGE OF VEHICLE FAULTS WITH 876 BYH

ALL REPORTED FAULTS, DISPLAYED BY PERCENTAGE OF OCCURRENCE DURING ALL MOT TESTS
PERCENTAGE OF VEHICLE FAULTS WITH 876 BYH
ALL REPORTED FAULTS, DISPLAYED BY PERCENTAGE OF OCCURRENCE DURING ALL MOT TESTS
ADVISORY

FAIL

USER ENTERED

PASS WITH RECTIFICATION

876 BYH annual Faults by type

ALL REPORTED FAULTS, DISPLAYED over time and categorised by type
876 BYH annual Faults by type
ALL REPORTED FAULTS, DISPLAYED over time and categorised by type

RECURRING FAULTS WITH 876 BYH

FAULTS THAT HAVE OCCURED MORE THAN ONCE DURING 876 BYH's MOT HISTORY
RECURRING FAULTS WITH 876 BYH
FAULTS THAT HAVE OCCURED MORE THAN ONCE DURING 876 BYH's MOT HISTORY
Fault Fault Test Date Test Date/Time Reference MOT Test Reference
4 Nearside front brake pipe slightly corroded (3.6.b.2c) Nearside front brake pipe slightly corroded (3.6.b.2c) 03 July 2013 [15:33] 03/07/2013 27 June 2013 [12:03] 27/06/2013 18 June 2009 [09:44] 18/06/2009 17 June 2009 [15:33] 17/06/2009 377234483137 377234483137 117298373140 117298373140 543419869168 543419869168 632808269163 632808269163
3 Offside rear shock absorber has a slightly worn bush (2.7.4) Offside rear shock absorber has a slightly worn bush (2.7.4) 25 June 2014 [12:12] 25/06/2014 19 June 2014 [08:45] 19/06/2014 26 June 2012 [15:44] 26/06/2012 908906274164 908906274164 647760674173 647760674173 698128872104 698128872104
2 Parking brake: efficiency below requirements (3.7.b.7) Parking brake: efficiency below requirements (3.7.b.7) 15 December 2014 [16:20] 15/12/2014 27 June 2013 [12:03] 27/06/2013 189999544327 189999544327 117298373140 117298373140
2 Nearside rear suspension spring mounting prescribed area is corroded but not considered excessive (2.4.a.3) Nearside rear suspension spring mounting prescribed area is corroded but not considered excessive (2.4.a.3) 03 July 2013 [15:33] 03/07/2013 27 June 2013 [12:03] 27/06/2013 377234483137 377234483137 117298373140 117298373140
2 Offside front suspension has slight play in a pin or bush of an upper wishbone inner bearing (2.5.b.1a) Offside front suspension has slight play in a pin or bush of an upper wishbone inner bearing (2.5.b.1a) 03 July 2013 [15:33] 03/07/2013 27 June 2013 [12:03] 27/06/2013 377234483137 377234483137 117298373140 117298373140
2 Front suspension has slight movement at wishbone bearing (2.5.a.1c) Front suspension has slight movement at wishbone bearing (2.5.a.1c) 03 July 2013 [15:33] 03/07/2013 27 June 2013 [12:03] 27/06/2013 377234483137 377234483137 117298373140 117298373140
2 Brakes imbalanced requirements only just met. It would appear that the braking system requires adjustment or repair. (3.7.b.5b) Brakes imbalanced requirements only just met. It would appear that the braking system requires adjustment or repair. (3.7.b.5b) 26 June 2012 [15:44] 26/06/2012 23 June 2011 [16:33] 23/06/2011 698128872104 698128872104 298704871440 298704871440
2 Exhaust has a minor leak of exhaust gases (7.1.2) Exhaust has a minor leak of exhaust gases (7.1.2) 18 June 2009 [09:44] 18/06/2009 17 June 2009 [15:33] 17/06/2009 543419869168 543419869168 632808269163 632808269163
2 Propshaft rear uj has slight movement Propshaft rear uj has slight movement 18 June 2009 [09:44] 18/06/2009 17 June 2009 [15:33] 17/06/2009 543419869168 543419869168 632808269163 632808269163

ALL 876 BYH ADVISORIES [21]

ALL ADVISORIES, ORDERED by OCCURRENCE DURING 876 BYH's MOT HISTORY
ALL 876 BYH ADVISORIES [21]
ALL ADVISORIES, ORDERED by OCCURRENCE DURING 876 BYH's MOT HISTORY
Advisory Faults | source www.vehiclestats.co.uk
Fault Fault Test Date Test Date/Time Reference MOT Test Reference
4 Nearside front brake pipe slightly corroded (3.6.b.2c) Nearside front brake pipe slightly corroded (3.6.b.2c) 03 July 2013 [15:33] 03/07/2013 27 June 2013 [12:03] 27/06/2013 18 June 2009 [09:44] 18/06/2009 17 June 2009 [15:33] 17/06/2009 377234483137 377234483137 117298373140 117298373140 543419869168 543419869168 632808269163 632808269163
3 Offside rear shock absorber has a slightly worn bush (2.7.4) Offside rear shock absorber has a slightly worn bush (2.7.4) 25 June 2014 [12:12] 25/06/2014 19 June 2014 [08:45] 19/06/2014 26 June 2012 [15:44] 26/06/2012 908906274164 908906274164 647760674173 647760674173 698128872104 698128872104
2 Nearside rear suspension spring mounting prescribed area is corroded but not considered excessive (2.4.a.3) Nearside rear suspension spring mounting prescribed area is corroded but not considered excessive (2.4.a.3) 03 July 2013 [15:33] 03/07/2013 27 June 2013 [12:03] 27/06/2013 377234483137 377234483137 117298373140 117298373140
2 Offside front suspension has slight play in a pin or bush of an upper wishbone inner bearing (2.5.b.1a) Offside front suspension has slight play in a pin or bush of an upper wishbone inner bearing (2.5.b.1a) 03 July 2013 [15:33] 03/07/2013 27 June 2013 [12:03] 27/06/2013 377234483137 377234483137 117298373140 117298373140
2 Front suspension has slight movement at wishbone bearing (2.5.a.1c) Front suspension has slight movement at wishbone bearing (2.5.a.1c) 03 July 2013 [15:33] 03/07/2013 27 June 2013 [12:03] 27/06/2013 377234483137 377234483137 117298373140 117298373140
2 Brakes imbalanced requirements only just met. It would appear that the braking system requires adjustment or repair. (3.7.b.5b) Brakes imbalanced requirements only just met. It would appear that the braking system requires adjustment or repair. (3.7.b.5b) 26 June 2012 [15:44] 26/06/2012 23 June 2011 [16:33] 23/06/2011 698128872104 698128872104 298704871440 298704871440
2 Exhaust has a minor leak of exhaust gases (7.1.2) Exhaust has a minor leak of exhaust gases (7.1.2) 18 June 2009 [09:44] 18/06/2009 17 June 2009 [15:33] 17/06/2009 543419869168 543419869168 632808269163 632808269163
1 Nearside rear shock absorber has a light misting of oil (2.7.3) Nearside rear shock absorber has a light misting of oil (2.7.3) 11 April 2018 [09:14] 11/04/2018 110185777146 110185777146
1 Advise oil leak Advise oil leak 21 March 2016 [09:07] 21/03/2016 617164316351 617164316351
1 Offside rear torque/reaction arm has slight play in a ball joint (2.4.g.2) Offside rear torque/reaction arm has slight play in a ball joint (2.4.g.2) 23 June 2011 [16:33] 23/06/2011 298704871440 298704871440
1 Nearside front lower suspension arm has slight play in a ball joint (2.4.g.2) Nearside front lower suspension arm has slight play in a ball joint (2.4.g.2) 17 June 2009 [15:33] 17/06/2009 632808269163 632808269163

ALL 876 BYH Failure Faults [13]

ALL Failure faults, ORDERED by OCCURRENCE DURING 876 BYH's MOT HISTORY
ALL 876 BYH Failure Faults [13]
ALL Failure faults, ORDERED by OCCURRENCE DURING 876 BYH's MOT HISTORY
Fail Faults | source www.vehiclestats.co.uk
Fault Fault Test Date Test Date/Time Reference MOT Test Reference
2 Parking brake: efficiency below requirements (3.7.b.7) Parking brake: efficiency below requirements (3.7.b.7) 15 December 2014 [16:20] 15/12/2014 27 June 2013 [12:03] 27/06/2013 189999544327 189999544327 117298373140 117298373140
1 Nearside stop lamp not working (1.2.1b) Nearside stop lamp not working (1.2.1b) 15 December 2014 [16:20] 15/12/2014 189999544327 189999544327
1 Nearside rear parking brake recording little or no effort (3.7.b.6a) Nearside rear parking brake recording little or no effort (3.7.b.6a) 15 December 2014 [16:20] 15/12/2014 189999544327 189999544327
1 Indicator switch faulty (1.4.a.1) Indicator switch faulty (1.4.a.1) 19 June 2014 [08:45] 19/06/2014 647760674173 647760674173
1 Nearside rear brake binding (3.7.b.1) Nearside rear brake binding (3.7.b.1) 19 June 2014 [08:45] 19/06/2014 647760674173 647760674173
1 Offside rear brake binding (3.7.b.1) Offside rear brake binding (3.7.b.1) 19 June 2014 [08:45] 19/06/2014 647760674173 647760674173
1 Rear brake application uneven (3.7.b.2) Rear brake application uneven (3.7.b.2) 19 June 2014 [08:45] 19/06/2014 647760674173 647760674173
1 Brakes imbalanced across an axle (3.7.b.5b) Brakes imbalanced across an axle (3.7.b.5b) 19 June 2014 [08:45] 19/06/2014 647760674173 647760674173
1 Offside rear suspension spring mounting prescribed area is excessively corroded (2.4.a.3) Offside rear suspension spring mounting prescribed area is excessively corroded (2.4.a.3) 27 June 2013 [12:03] 27/06/2013 117298373140 117298373140
1 Front brake application uneven (3.7.b.2) Front brake application uneven (3.7.b.2) 27 June 2013 [12:03] 27/06/2013 117298373140 117298373140
1 Nearside headlamp not working on main beam (1.7.5a) Nearside headlamp not working on main beam (1.7.5a) 17 June 2009 [15:33] 17/06/2009 632808269163 632808269163
1 Offside front lower suspension arm has excessive play in a ball joint (2.4.g.2) Offside front lower suspension arm has excessive play in a ball joint (2.4.g.2) 17 June 2009 [15:33] 17/06/2009 632808269163 632808269163

ALL 876 BYH User Entered Faults [4]

ALL User Entered faults, ORDERED by OCCURRENCE DURING 876 BYH's MOT HISTORY
ALL 876 BYH User Entered Faults [4]
ALL User Entered faults, ORDERED by OCCURRENCE DURING 876 BYH's MOT HISTORY
Advisory Faults | source www.vehiclestats.co.uk
Fault Fault Test Date Test Date/Time Reference MOT Test Reference
2 Propshaft rear uj has slight movement Propshaft rear uj has slight movement 18 June 2009 [09:44] 18/06/2009 17 June 2009 [15:33] 17/06/2009 543419869168 543419869168 632808269163 632808269163
1 Advise engine smokes at idle Advise engine smokes at idle 15 April 2015 [10:04] 15/04/2015 385405705188 385405705188
1 Front propshaft uj slightly worn Front propshaft uj slightly worn 26 June 2012 [15:44] 26/06/2012 698128872104 698128872104

ALL 876 BYH Pass With Rectification Faults [1]

ALL Pass With Rectification faults, ORDERED by OCCURRENCE DURING 876 BYH's MOT HISTORY
ALL 876 BYH Pass With Rectification Faults [1]
ALL Pass With Rectification faults, ORDERED by OCCURRENCE DURING 876 BYH's MOT HISTORY
Pass With Rectification Faults | source www.vehiclestats.co.uk
Fault Fault Test Date Test Date/Time Reference MOT Test Reference
1 Rear stop lamp not working (1.2.1b) Rear stop lamp not working (1.2.1b) 27 June 2006 [09:28] 27/06/2006 664928276109 664928276109

MOT TEST: 11 April 2018 09:14:57 PASSED
MOT TEST: 11 April 2018 09:14:57 PASSED

This test (110185777146) was completed on the 11 April 2018 09:14:57 and PASSED the requirements for a valid MOT with 1 comments.

This test (110185777146) was completed on the 11 April 2018 09:14:57 and PASSED the requirements for a valid MOT with 1 comments.

Recorded mileage: 2,089

Recorded mileage: 2,089


ADVISORY


MOT TEST: 28 March 2017 08:50:48 PASSED
MOT TEST: 28 March 2017 08:50:48 PASSED

This test (223367962103) was completed on the 28 March 2017 08:50:48 and PASSED the requirements for a valid MOT with 0 comments.

This test (223367962103) was completed on the 28 March 2017 08:50:48 and PASSED the requirements for a valid MOT with 0 comments.

Recorded mileage: 1,347

Recorded mileage: 1,347


MOT TEST: 21 March 2016 09:07:11 PASSED
MOT TEST: 21 March 2016 09:07:11 PASSED

This test (617164316351) was completed on the 21 March 2016 09:07:11 and PASSED the requirements for a valid MOT with 1 comments.

This test (617164316351) was completed on the 21 March 2016 09:07:11 and PASSED the requirements for a valid MOT with 1 comments.

Recorded mileage: 692

Recorded mileage: 692


ADVISORY


MOT TEST: 15 April 2015 10:04:22 PASSED
MOT TEST: 15 April 2015 10:04:22 PASSED

This test (385405705188) was completed on the 15 April 2015 10:04:22 and PASSED the requirements for a valid MOT with 1 comments.

This test (385405705188) was completed on the 15 April 2015 10:04:22 and PASSED the requirements for a valid MOT with 1 comments.

Recorded mileage: 299

Recorded mileage: 299


USER ENTERED


MOT TEST: 17 December 2014 13:05:41 PASSED
MOT TEST: 17 December 2014 13:05:41 PASSED

This test (406941654496) was completed on the 17 December 2014 13:05:41 and PASSED the requirements for a valid MOT with 0 comments.

This test (406941654496) was completed on the 17 December 2014 13:05:41 and PASSED the requirements for a valid MOT with 0 comments.

Recorded mileage: 16

Recorded mileage: 16


MOT TEST: 15 December 2014 16:20:27 FAILED
MOT TEST: 15 December 2014 16:20:27 FAILED

This test (189999544327) was completed on the 15 December 2014 16:20:27 and FAILED the requirements for a valid MOT with 3 comments.

This test (189999544327) was completed on the 15 December 2014 16:20:27 and FAILED the requirements for a valid MOT with 3 comments.

Recorded mileage: 15

Recorded mileage: 15


FAIL


MOT TEST: 25 June 2014 12:12:17 PASSED
MOT TEST: 25 June 2014 12:12:17 PASSED

This test (908906274164) was completed on the 25 June 2014 12:12:17 and PASSED the requirements for a valid MOT with 1 comments.

This test (908906274164) was completed on the 25 June 2014 12:12:17 and PASSED the requirements for a valid MOT with 1 comments.

Recorded mileage: 62,708

Recorded mileage: 62,708


ADVISORY


MOT TEST: 19 June 2014 08:45:49 FAILED
MOT TEST: 19 June 2014 08:45:49 FAILED

This test (647760674173) was completed on the 19 June 2014 08:45:49 and FAILED the requirements for a valid MOT with 6 comments.

This test (647760674173) was completed on the 19 June 2014 08:45:49 and FAILED the requirements for a valid MOT with 6 comments.

Recorded mileage: 62,702

Recorded mileage: 62,702


ADVISORY

FAIL


MOT TEST: 03 July 2013 15:33:32 PASSED
MOT TEST: 03 July 2013 15:33:32 PASSED

This test (377234483137) was completed on the 03 July 2013 15:33:32 and PASSED the requirements for a valid MOT with 4 comments.

This test (377234483137) was completed on the 03 July 2013 15:33:32 and PASSED the requirements for a valid MOT with 4 comments.

Recorded mileage: 62,550

Recorded mileage: 62,550


ADVISORY


MOT TEST: 27 June 2013 12:03:08 FAILED
MOT TEST: 27 June 2013 12:03:08 FAILED

This test (117298373140) was completed on the 27 June 2013 12:03:08 and FAILED the requirements for a valid MOT with 7 comments.

This test (117298373140) was completed on the 27 June 2013 12:03:08 and FAILED the requirements for a valid MOT with 7 comments.

Recorded mileage: 62,545

Recorded mileage: 62,545


ADVISORY

FAIL


MOT TEST: 26 June 2012 15:44:24 PASSED
MOT TEST: 26 June 2012 15:44:24 PASSED

This test (698128872104) was completed on the 26 June 2012 15:44:24 and PASSED the requirements for a valid MOT with 3 comments.

This test (698128872104) was completed on the 26 June 2012 15:44:24 and PASSED the requirements for a valid MOT with 3 comments.

Recorded mileage: 62,533

Recorded mileage: 62,533


ADVISORY

USER ENTERED


MOT TEST: 23 June 2011 16:33:58 PASSED
MOT TEST: 23 June 2011 16:33:58 PASSED

This test (298704871440) was completed on the 23 June 2011 16:33:58 and PASSED the requirements for a valid MOT with 2 comments.

This test (298704871440) was completed on the 23 June 2011 16:33:58 and PASSED the requirements for a valid MOT with 2 comments.

Recorded mileage: 62,371

Recorded mileage: 62,371


ADVISORY


MOT TEST: 29 June 2010 09:38:01 PASSED
MOT TEST: 29 June 2010 09:38:01 PASSED

This test (350860980188) was completed on the 29 June 2010 09:38:01 and PASSED the requirements for a valid MOT with 0 comments.

This test (350860980188) was completed on the 29 June 2010 09:38:01 and PASSED the requirements for a valid MOT with 0 comments.

Recorded mileage: 62,291

Recorded mileage: 62,291


MOT TEST: 18 June 2009 09:44:57 PASSED
MOT TEST: 18 June 2009 09:44:57 PASSED

This test (543419869168) was completed on the 18 June 2009 09:44:57 and PASSED the requirements for a valid MOT with 3 comments.

This test (543419869168) was completed on the 18 June 2009 09:44:57 and PASSED the requirements for a valid MOT with 3 comments.

Recorded mileage: 61,977

Recorded mileage: 61,977


ADVISORY

USER ENTERED


MOT TEST: 17 June 2009 15:33:46 FAILED
MOT TEST: 17 June 2009 15:33:46 FAILED

This test (632808269163) was completed on the 17 June 2009 15:33:46 and FAILED the requirements for a valid MOT with 6 comments.

This test (632808269163) was completed on the 17 June 2009 15:33:46 and FAILED the requirements for a valid MOT with 6 comments.

Recorded mileage: 61,977

Recorded mileage: 61,977


ADVISORY

FAIL

USER ENTERED


MOT TEST: 01 July 2008 14:37:05 PASSED
MOT TEST: 01 July 2008 14:37:05 PASSED

This test (840473188193) was completed on the 01 July 2008 14:37:05 and PASSED the requirements for a valid MOT with 0 comments.

This test (840473188193) was completed on the 01 July 2008 14:37:05 and PASSED the requirements for a valid MOT with 0 comments.

Recorded mileage: 61,687

Recorded mileage: 61,687


MOT TEST: 27 June 2007 16:33:56 PASSED
MOT TEST: 27 June 2007 16:33:56 PASSED

This test (614178577176) was completed on the 27 June 2007 16:33:56 and PASSED the requirements for a valid MOT with 0 comments.

This test (614178577176) was completed on the 27 June 2007 16:33:56 and PASSED the requirements for a valid MOT with 0 comments.

Recorded mileage: 61,181

Recorded mileage: 61,181


MOT TEST: 27 June 2006 09:28:59 PASSED
MOT TEST: 27 June 2006 09:28:59 PASSED

This test (482788476136) was completed on the 27 June 2006 09:28:59 and PASSED the requirements for a valid MOT with 0 comments.

This test (482788476136) was completed on the 27 June 2006 09:28:59 and PASSED the requirements for a valid MOT with 0 comments.

Recorded mileage: 60,519

Recorded mileage: 60,519


MOT TEST: 27 June 2006 09:28:59 FAILED
MOT TEST: 27 June 2006 09:28:59 FAILED

This test (664928276109) was completed on the 27 June 2006 09:28:59 and FAILED the requirements for a valid MOT with 1 comments.

This test (664928276109) was completed on the 27 June 2006 09:28:59 and FAILED the requirements for a valid MOT with 1 comments.

Recorded mileage: 60,519

Recorded mileage: 60,519


PASS WITH RECTIFICATION