876 KRE


876KRE is registered to a Green 1956, Morris Minor with a Petrol engine. It Failed its most recent MOT Test on the 11 August 2012

9 unique faults (9 Total) reported in its MOT History (7 Tests).

0 common/recurring faults.

71% (5) MOT Pass Rate and a 29% (2) MOT Failure Rate.

73,229 recorded miles.

876 KRE


876KRE is registered to a Green 1956, Morris Minor with a Petrol engine. It Failed its most recent MOT Test on the 11 August 2012

9 unique faults (9 Total) reported in its MOT History (7 Tests).

0 common/recurring faults.

71% (5) MOT Pass Rate and a 29% (2) MOT Failure Rate.

73,229 recorded miles.

MOT PASS/Failure rate for 876 KRE

all MOT test results for 876 KRE represented as a percentage
MOT PASS/Failure rate for 876 KRE
all MOT test results for 876 KRE represented as a percentage

PERCENTAGE OF VEHICLE FAULTS WITH 876 KRE

ALL REPORTED FAULTS, DISPLAYED BY PERCENTAGE OF OCCURRENCE DURING ALL MOT TESTS
PERCENTAGE OF VEHICLE FAULTS WITH 876 KRE
ALL REPORTED FAULTS, DISPLAYED BY PERCENTAGE OF OCCURRENCE DURING ALL MOT TESTS
FAIL

876 KRE annual Faults by type

ALL REPORTED FAULTS, DISPLAYED over time and categorised by type
876 KRE annual Faults by type
ALL REPORTED FAULTS, DISPLAYED over time and categorised by type

ALL 876 KRE Failure Faults [9]

ALL Failure faults, ORDERED by OCCURRENCE DURING 876 KRE's MOT HISTORY
ALL 876 KRE Failure Faults [9]
ALL Failure faults, ORDERED by OCCURRENCE DURING 876 KRE's MOT HISTORY
Fail Faults | source www.vehiclestats.co.uk
Fault Fault Test Date Test Date/Time Reference MOT Test Reference
1 Service brake: efficiency below requirements (3.7.b.7) Service brake: efficiency below requirements (3.7.b.7) 26 July 2010 [09:43] 26/07/2010 283117900263 283117900263
1 Front exhaust has a major leak of exhaust gases (7.1.2) Front exhaust has a major leak of exhaust gases (7.1.2) 26 July 2010 [09:43] 26/07/2010 283117900263 283117900263
1 Nearside stop lamp not working (1.2.1b) Nearside stop lamp not working (1.2.1b) 14 August 2008 [10:11] 14/08/2008 404237828235 404237828235
1 Offside stop lamp not working (1.2.1b) Offside stop lamp not working (1.2.1b) 14 August 2008 [10:11] 14/08/2008 404237828235 404237828235
1 Fuel cap/sealing device sealing washer missing (7.2.4c) Fuel cap/sealing device sealing washer missing (7.2.4c) 14 August 2008 [10:11] 14/08/2008 404237828235 404237828235
1 Nearside front tyre has a cut in excess of the requirements deep enough to reach the ply or cords (4.1.d.1a) Nearside front tyre has a cut in excess of the requirements deep enough to reach the ply or cords (4.1.d.1a) 14 August 2008 [10:11] 14/08/2008 404237828235 404237828235
1 Nearside rear tyre has a cut in excess of the requirements deep enough to reach the ply or cords (4.1.d.1a) Nearside rear tyre has a cut in excess of the requirements deep enough to reach the ply or cords (4.1.d.1a) 14 August 2008 [10:11] 14/08/2008 404237828235 404237828235
1 Offside front front brake binding (3.7.b.1) Offside front front brake binding (3.7.b.1) 14 August 2008 [10:11] 14/08/2008 404237828235 404237828235
1 Nearside rear front brake binding (3.7.b.1) Nearside rear front brake binding (3.7.b.1) 14 August 2008 [10:11] 14/08/2008 404237828235 404237828235

MOT TEST: 11 August 2012 08:29:43 PASSED
MOT TEST: 11 August 2012 08:29:43 PASSED

This test (248644322234) was completed on the 11 August 2012 08:29:43 and PASSED the requirements for a valid MOT with 0 comments.

This test (248644322234) was completed on the 11 August 2012 08:29:43 and PASSED the requirements for a valid MOT with 0 comments.

Recorded mileage: 73,229

Recorded mileage: 73,229


MOT TEST: 11 August 2011 08:35:26 PASSED
MOT TEST: 11 August 2011 08:35:26 PASSED

This test (845373921273) was completed on the 11 August 2011 08:35:26 and PASSED the requirements for a valid MOT with 0 comments.

This test (845373921273) was completed on the 11 August 2011 08:35:26 and PASSED the requirements for a valid MOT with 0 comments.

Recorded mileage: 70,259

Recorded mileage: 70,259


MOT TEST: 30 July 2010 14:03:52 PASSED
MOT TEST: 30 July 2010 14:03:52 PASSED

This test (701091510297) was completed on the 30 July 2010 14:03:52 and PASSED the requirements for a valid MOT with 0 comments.

This test (701091510297) was completed on the 30 July 2010 14:03:52 and PASSED the requirements for a valid MOT with 0 comments.

Recorded mileage: 68,212

Recorded mileage: 68,212


MOT TEST: 26 July 2010 09:43:25 FAILED
MOT TEST: 26 July 2010 09:43:25 FAILED

This test (283117900263) was completed on the 26 July 2010 09:43:25 and FAILED the requirements for a valid MOT with 2 comments.

This test (283117900263) was completed on the 26 July 2010 09:43:25 and FAILED the requirements for a valid MOT with 2 comments.

Recorded mileage: 68,212

Recorded mileage: 68,212


FAIL


MOT TEST: 26 August 2008 17:36:48 PASSED
MOT TEST: 26 August 2008 17:36:48 PASSED

This test (374989738448) was completed on the 26 August 2008 17:36:48 and PASSED the requirements for a valid MOT with 0 comments.

This test (374989738448) was completed on the 26 August 2008 17:36:48 and PASSED the requirements for a valid MOT with 0 comments.

Recorded mileage: 68,136

Recorded mileage: 68,136


MOT TEST: 14 August 2008 10:11:19 FAILED
MOT TEST: 14 August 2008 10:11:19 FAILED

This test (404237828235) was completed on the 14 August 2008 10:11:19 and FAILED the requirements for a valid MOT with 7 comments.

This test (404237828235) was completed on the 14 August 2008 10:11:19 and FAILED the requirements for a valid MOT with 7 comments.

Recorded mileage: 68,115

Recorded mileage: 68,115


FAIL


MOT TEST: 22 November 2006 12:16:46 PASSED
MOT TEST: 22 November 2006 12:16:46 PASSED

This test (113716226337) was completed on the 22 November 2006 12:16:46 and PASSED the requirements for a valid MOT with 0 comments.

This test (113716226337) was completed on the 22 November 2006 12:16:46 and PASSED the requirements for a valid MOT with 0 comments.

Recorded mileage: 67,645

Recorded mileage: 67,645