876 UXV


876UXV is registered to a Cream 1971, Morris Minor 1000 with a Petrol engine. It Failed its most recent MOT Test on the 11 August 2007

5 unique faults (9 Total) reported in its MOT History (2 Tests).

2 common/recurring faults, the most frequent (2 times) is: Nearside Front Suspension component mounting prescribed area is excessively corroded (2.4.A.3).

0% (0) MOT Pass Rate and a 100% (2) MOT Failure Rate.

43,160 recorded miles.

876 UXV


876UXV is registered to a Cream 1971, Morris Minor 1000 with a Petrol engine. It Failed its most recent MOT Test on the 11 August 2007

5 unique faults (9 Total) reported in its MOT History (2 Tests).

2 common/recurring faults, the most frequent (2 times) is: Nearside Front Suspension component mounting prescribed area is excessively corroded (2.4.A.3).

0% (0) MOT Pass Rate and a 100% (2) MOT Failure Rate.

43,160 recorded miles.

MOT PASS/Failure rate for 876 UXV

all MOT test results for 876 UXV represented as a percentage
MOT PASS/Failure rate for 876 UXV
all MOT test results for 876 UXV represented as a percentage

PERCENTAGE OF VEHICLE FAULTS WITH 876 UXV

ALL REPORTED FAULTS, DISPLAYED BY PERCENTAGE OF OCCURRENCE DURING ALL MOT TESTS
PERCENTAGE OF VEHICLE FAULTS WITH 876 UXV
ALL REPORTED FAULTS, DISPLAYED BY PERCENTAGE OF OCCURRENCE DURING ALL MOT TESTS
FAIL

876 UXV annual Faults by type

ALL REPORTED FAULTS, DISPLAYED over time and categorised by type
876 UXV annual Faults by type
ALL REPORTED FAULTS, DISPLAYED over time and categorised by type

RECURRING FAULTS WITH 876 UXV

FAULTS THAT HAVE OCCURED MORE THAN ONCE DURING 876 UXV's MOT HISTORY
RECURRING FAULTS WITH 876 UXV
FAULTS THAT HAVE OCCURED MORE THAN ONCE DURING 876 UXV's MOT HISTORY
Fault Fault Test Date Test Date/Time Reference MOT Test Reference
2 Nearside front suspension component mounting prescribed area is excessively corroded (2.4.a.3) Nearside front suspension component mounting prescribed area is excessively corroded (2.4.a.3) 11 August 2007 [09:51] 11/08/2007 20 December 2006 [09:11] 20/12/2006 692253527247 692253527247 413944456426 413944456426
2 Offside front suspension component mounting prescribed area is excessively corroded (2.4.a.3) Offside front suspension component mounting prescribed area is excessively corroded (2.4.a.3) 11 August 2007 [09:51] 11/08/2007 20 December 2006 [09:11] 20/12/2006 692253527247 692253527247 413944456426 413944456426

ALL 876 UXV Failure Faults [9]

ALL Failure faults, ORDERED by OCCURRENCE DURING 876 UXV's MOT HISTORY
ALL 876 UXV Failure Faults [9]
ALL Failure faults, ORDERED by OCCURRENCE DURING 876 UXV's MOT HISTORY
Fail Faults | source www.vehiclestats.co.uk
Fault Fault Test Date Test Date/Time Reference MOT Test Reference
2 Nearside front suspension component mounting prescribed area is excessively corroded (2.4.a.3) Nearside front suspension component mounting prescribed area is excessively corroded (2.4.a.3) 11 August 2007 [09:51] 11/08/2007 20 December 2006 [09:11] 20/12/2006 692253527247 692253527247 413944456426 413944456426
2 Offside front suspension component mounting prescribed area is excessively corroded (2.4.a.3) Offside front suspension component mounting prescribed area is excessively corroded (2.4.a.3) 11 August 2007 [09:51] 11/08/2007 20 December 2006 [09:11] 20/12/2006 692253527247 692253527247 413944456426 413944456426
1 Brakes imbalanced across an axle (3.7.b.5b) Brakes imbalanced across an axle (3.7.b.5b) 11 August 2007 [09:51] 11/08/2007 692253527247 692253527247
1 Suspension component mounting prescribed area is excessively corroded (2.4.a.3) Suspension component mounting prescribed area is excessively corroded (2.4.a.3) 20 December 2006 [09:11] 20/12/2006 413944456426 413944456426
1 Nearside rear suspension component mounting prescribed area is excessively corroded (2.4.a.3) Nearside rear suspension component mounting prescribed area is excessively corroded (2.4.a.3) 20 December 2006 [09:11] 20/12/2006 413944456426 413944456426

MOT TEST: 11 August 2007 09:51:43 FAILED
MOT TEST: 11 August 2007 09:51:43 FAILED

This test (692253527247) was completed on the 11 August 2007 09:51:43 and FAILED the requirements for a valid MOT with 3 comments.

This test (692253527247) was completed on the 11 August 2007 09:51:43 and FAILED the requirements for a valid MOT with 3 comments.

Recorded mileage: 4,342

Recorded mileage: 4,342


FAIL


MOT TEST: 20 December 2006 09:11:49 FAILED
MOT TEST: 20 December 2006 09:11:49 FAILED

This test (413944456426) was completed on the 20 December 2006 09:11:49 and FAILED the requirements for a valid MOT with 6 comments.

This test (413944456426) was completed on the 20 December 2006 09:11:49 and FAILED the requirements for a valid MOT with 6 comments.

Recorded mileage: 43,160

Recorded mileage: 43,160


FAIL