895 CRU


895CRU is registered to a White 1956, Morris Minor with a Petrol engine. It Failed its most recent MOT Test on the 05 April 2012

8 unique faults (8 Total) reported in its MOT History (6 Tests).

0 common/recurring faults.

67% (4) MOT Pass Rate and a 33% (2) MOT Failure Rate.

69,999 recorded miles.

895 CRU


895CRU is registered to a White 1956, Morris Minor with a Petrol engine. It Failed its most recent MOT Test on the 05 April 2012

8 unique faults (8 Total) reported in its MOT History (6 Tests).

0 common/recurring faults.

67% (4) MOT Pass Rate and a 33% (2) MOT Failure Rate.

69,999 recorded miles.

MOT PASS/Failure rate for 895 CRU

all MOT test results for 895 CRU represented as a percentage
MOT PASS/Failure rate for 895 CRU
all MOT test results for 895 CRU represented as a percentage

PERCENTAGE OF VEHICLE FAULTS WITH 895 CRU

ALL REPORTED FAULTS, DISPLAYED BY PERCENTAGE OF OCCURRENCE DURING ALL MOT TESTS
PERCENTAGE OF VEHICLE FAULTS WITH 895 CRU
ALL REPORTED FAULTS, DISPLAYED BY PERCENTAGE OF OCCURRENCE DURING ALL MOT TESTS
FAIL

895 CRU annual Faults by type

ALL REPORTED FAULTS, DISPLAYED over time and categorised by type
895 CRU annual Faults by type
ALL REPORTED FAULTS, DISPLAYED over time and categorised by type

ALL 895 CRU Failure Faults [8]

ALL Failure faults, ORDERED by OCCURRENCE DURING 895 CRU's MOT HISTORY
ALL 895 CRU Failure Faults [8]
ALL Failure faults, ORDERED by OCCURRENCE DURING 895 CRU's MOT HISTORY
Fail Faults | source www.vehiclestats.co.uk
Fault Fault Test Date Test Date/Time Reference MOT Test Reference
1 Nearside rear rear brake recording little or no effort (3.7.b.5a) Nearside rear rear brake recording little or no effort (3.7.b.5a) 30 April 2009 [13:50] 30/04/2009 151550429158 151550429158
1 Nearside rear parking brake recording little or no effort (3.7.b.6a) Nearside rear parking brake recording little or no effort (3.7.b.6a) 30 April 2009 [13:50] 30/04/2009 151550429158 151550429158
1 Parking brake: efficiency below requirements (3.7.b.7) Parking brake: efficiency below requirements (3.7.b.7) 30 April 2009 [13:50] 30/04/2009 151550429158 151550429158
1 Nearside front upper front suspension locking device missing (2.5.a.4) Nearside front upper front suspension locking device missing (2.5.a.4) 07 August 2006 [15:52] 07/08/2006 702699916221 702699916221
1 Offside front upper front suspension locking device missing (2.5.a.4) Offside front upper front suspension locking device missing (2.5.a.4) 07 August 2006 [15:52] 07/08/2006 702699916221 702699916221
1 Nearside front front suspension locking device missing (2.5.a.4) Nearside front front suspension locking device missing (2.5.a.4) 07 August 2006 [15:52] 07/08/2006 702699916221 702699916221
1 Offside front front suspension locking device missing (2.5.a.4) Offside front front suspension locking device missing (2.5.a.4) 07 August 2006 [15:52] 07/08/2006 702699916221 702699916221
1 Front exhaust system not adequately supported (7.1.1) Front exhaust system not adequately supported (7.1.1) 07 August 2006 [15:52] 07/08/2006 702699916221 702699916221

MOT TEST: 05 April 2012 10:53:17 PASSED
MOT TEST: 05 April 2012 10:53:17 PASSED

This test (808726792090) was completed on the 05 April 2012 10:53:17 and PASSED the requirements for a valid MOT with 0 comments.

This test (808726792090) was completed on the 05 April 2012 10:53:17 and PASSED the requirements for a valid MOT with 0 comments.

Recorded mileage: 69,999

Recorded mileage: 69,999


MOT TEST: 05 May 2009 16:56:55 PASSED
MOT TEST: 05 May 2009 16:56:55 PASSED

This test (222915929182) was completed on the 05 May 2009 16:56:55 and PASSED the requirements for a valid MOT with 0 comments.

This test (222915929182) was completed on the 05 May 2009 16:56:55 and PASSED the requirements for a valid MOT with 0 comments.

Recorded mileage: 69,999

Recorded mileage: 69,999


MOT TEST: 30 April 2009 13:50:51 FAILED
MOT TEST: 30 April 2009 13:50:51 FAILED

This test (151550429158) was completed on the 30 April 2009 13:50:51 and FAILED the requirements for a valid MOT with 3 comments.

This test (151550429158) was completed on the 30 April 2009 13:50:51 and FAILED the requirements for a valid MOT with 3 comments.

Recorded mileage: 69,999

Recorded mileage: 69,999


FAIL


MOT TEST: 02 May 2008 10:54:49 PASSED
MOT TEST: 02 May 2008 10:54:49 PASSED

This test (660463128149) was completed on the 02 May 2008 10:54:49 and PASSED the requirements for a valid MOT with 0 comments.

This test (660463128149) was completed on the 02 May 2008 10:54:49 and PASSED the requirements for a valid MOT with 0 comments.

Recorded mileage: 69,999

Recorded mileage: 69,999


MOT TEST: 14 August 2006 15:52:49 PASSED
MOT TEST: 14 August 2006 15:52:49 PASSED

This test (290926826253) was completed on the 14 August 2006 15:52:49 and PASSED the requirements for a valid MOT with 0 comments.

This test (290926826253) was completed on the 14 August 2006 15:52:49 and PASSED the requirements for a valid MOT with 0 comments.

Recorded mileage: 69,999

Recorded mileage: 69,999


MOT TEST: 07 August 2006 15:52:30 FAILED
MOT TEST: 07 August 2006 15:52:30 FAILED

This test (702699916221) was completed on the 07 August 2006 15:52:30 and FAILED the requirements for a valid MOT with 5 comments.

This test (702699916221) was completed on the 07 August 2006 15:52:30 and FAILED the requirements for a valid MOT with 5 comments.

Recorded mileage: 69,999

Recorded mileage: 69,999


FAIL