898 XAF


898XAF is registered to a Blue 1971, Morris Minor with a Petrol engine. It Failed its most recent MOT Test on the 07 August 2007

27 unique faults (30 Total) reported in its MOT History (3 Tests).

0 common/recurring faults.

33% (1) MOT Pass Rate and a 67% (2) MOT Failure Rate.

60,045 recorded miles.

898 XAF


898XAF is registered to a Blue 1971, Morris Minor with a Petrol engine. It Failed its most recent MOT Test on the 07 August 2007

27 unique faults (30 Total) reported in its MOT History (3 Tests).

0 common/recurring faults.

33% (1) MOT Pass Rate and a 67% (2) MOT Failure Rate.

60,045 recorded miles.

MOT PASS/Failure rate for 898 XAF

all MOT test results for 898 XAF represented as a percentage
MOT PASS/Failure rate for 898 XAF
all MOT test results for 898 XAF represented as a percentage

PERCENTAGE OF VEHICLE FAULTS WITH 898 XAF

ALL REPORTED FAULTS, DISPLAYED BY PERCENTAGE OF OCCURRENCE DURING ALL MOT TESTS
PERCENTAGE OF VEHICLE FAULTS WITH 898 XAF
ALL REPORTED FAULTS, DISPLAYED BY PERCENTAGE OF OCCURRENCE DURING ALL MOT TESTS
ADVISORY

FAIL

USER ENTERED

898 XAF annual Faults by type

ALL REPORTED FAULTS, DISPLAYED over time and categorised by type
898 XAF annual Faults by type
ALL REPORTED FAULTS, DISPLAYED over time and categorised by type

ALL 898 XAF ADVISORIES [1]

ALL ADVISORIES, ORDERED by OCCURRENCE DURING 898 XAF's MOT HISTORY
ALL 898 XAF ADVISORIES [1]
ALL ADVISORIES, ORDERED by OCCURRENCE DURING 898 XAF's MOT HISTORY
Fail Faults | source www.vehiclestats.co.uk
Fault Fault Test Date Test Date/Time Reference MOT Test Reference
1 Exhaust has a minor leak of exhaust gases (7.1.2) Exhaust has a minor leak of exhaust gases (7.1.2) 19 April 2006 [16:46] 19/04/2006 342619306132 342619306132

ALL 898 XAF Failure Faults [24]

ALL Failure faults, ORDERED by OCCURRENCE DURING 898 XAF's MOT HISTORY
ALL 898 XAF Failure Faults [24]
ALL Failure faults, ORDERED by OCCURRENCE DURING 898 XAF's MOT HISTORY
Fail Faults | source www.vehiclestats.co.uk
Fault Fault Test Date Test Date/Time Reference MOT Test Reference
1 Stop lamp not working (1.2.1b) Stop lamp not working (1.2.1b) 01 August 2007 [17:16] 01/08/2007 314333717479 314333717479
1 Nearside rear tyre tread depth below requirements of 1.6mm (4.1.e.1) Nearside rear tyre tread depth below requirements of 1.6mm (4.1.e.1) 01 August 2007 [17:16] 01/08/2007 314333717479 314333717479
1 Nearside rear suspension component mounting prescribed area is excessively corroded (2.4.a.3) Nearside rear suspension component mounting prescribed area is excessively corroded (2.4.a.3) 01 August 2007 [17:16] 01/08/2007 314333717479 314333717479
1 Offside front wheel nut(s) missing (4.2.a.1e) Offside front wheel nut(s) missing (4.2.a.1e) 01 August 2007 [17:16] 01/08/2007 314333717479 314333717479
1 Nearside suspension component mounting prescribed area is excessively corroded (2.4.a.3) Nearside suspension component mounting prescribed area is excessively corroded (2.4.a.3) 01 August 2007 [17:16] 01/08/2007 314333717479 314333717479
1 Offside rear suspension component mounting prescribed area is excessively corroded (2.4.a.3) Offside rear suspension component mounting prescribed area is excessively corroded (2.4.a.3) 01 August 2007 [17:16] 01/08/2007 314333717479 314333717479
1 Parking brake: efficiency below requirements (3.7.b.7) Parking brake: efficiency below requirements (3.7.b.7) 01 August 2007 [17:16] 01/08/2007 314333717479 314333717479
1 Windscreen washer provides insufficient washer liquid (8.2.3) Windscreen washer provides insufficient washer liquid (8.2.3) 19 April 2006 [16:46] 19/04/2006 342619306132 342619306132
1 Nearside windscreen wiper blade deteriorated (8.2.2) Nearside windscreen wiper blade deteriorated (8.2.2) 19 April 2006 [16:46] 19/04/2006 342619306132 342619306132
1 Nearside headlamp not working on dipped beam (1.7.5a) Nearside headlamp not working on dipped beam (1.7.5a) 19 April 2006 [16:46] 19/04/2006 342619306132 342619306132
1 Nearside rear direction indicator not working (1.4.a.2c) Nearside rear direction indicator not working (1.4.a.2c) 19 April 2006 [16:46] 19/04/2006 342619306132 342619306132
1 Offside front direction indicator not working (1.4.a.2c) Offside front direction indicator not working (1.4.a.2c) 19 April 2006 [16:46] 19/04/2006 342619306132 342619306132
1 Offside rear direction indicator not working (1.4.a.2c) Offside rear direction indicator not working (1.4.a.2c) 19 April 2006 [16:46] 19/04/2006 342619306132 342619306132
1 Nearside rear position lamp(s) excessively deteriorated so that it is not visible from a reasonable distance (1.1.a.3d) Nearside rear position lamp(s) excessively deteriorated so that it is not visible from a reasonable distance (1.1.a.3d) 19 April 2006 [16:46] 19/04/2006 342619306132 342619306132
1 Exhaust has a major leak of exhaust gases (7.1.2) Exhaust has a major leak of exhaust gases (7.1.2) 19 April 2006 [16:46] 19/04/2006 342619306132 342619306132
1 Offside vehicle structure has excessive corrosion, seriously affecting its strength within 30cm of the body mountings (6.1.b.2) Offside vehicle structure has excessive corrosion, seriously affecting its strength within 30cm of the body mountings (6.1.b.2) 19 April 2006 [16:46] 19/04/2006 342619306132 342619306132
1 Brake pipe excessively corroded (3.6.b.2c) Brake pipe excessively corroded (3.6.b.2c) 19 April 2006 [16:46] 19/04/2006 342619306132 342619306132
1 Offside front brake hose excessively deteriorated (3.6.b.4d) Offside front brake hose excessively deteriorated (3.6.b.4d) 19 April 2006 [16:46] 19/04/2006 342619306132 342619306132
1 Nearside suspension spring mounting prescribed area is excessively corroded (2.4.a.3) Nearside suspension spring mounting prescribed area is excessively corroded (2.4.a.3) 19 April 2006 [16:46] 19/04/2006 342619306132 342619306132
1 Nearside rear suspension spring mounting prescribed area is excessively corroded (2.4.a.3) Nearside rear suspension spring mounting prescribed area is excessively corroded (2.4.a.3) 19 April 2006 [16:46] 19/04/2006 342619306132 342619306132
1 Offside rear suspension spring mounting prescribed area is excessively corroded (2.4.a.3) Offside rear suspension spring mounting prescribed area is excessively corroded (2.4.a.3) 19 April 2006 [16:46] 19/04/2006 342619306132 342619306132

ALL 898 XAF User Entered Faults [5]

ALL User Entered faults, ORDERED by OCCURRENCE DURING 898 XAF's MOT HISTORY
ALL 898 XAF User Entered Faults [5]
ALL User Entered faults, ORDERED by OCCURRENCE DURING 898 XAF's MOT HISTORY
Fail Faults | source www.vehiclestats.co.uk
Fault Fault Test Date Test Date/Time Reference MOT Test Reference
1 Offside and nearside front tyres underinflated Offside and nearside front tyres underinflated 19 April 2006 [16:46] 19/04/2006 342619306132 342619306132
1 Cracking to sidewalls offside and nearside rear tyres Cracking to sidewalls offside and nearside rear tyres 19 April 2006 [16:46] 19/04/2006 342619306132 342619306132
1 Oil leak Oil leak 19 April 2006 [16:46] 19/04/2006 342619306132 342619306132
1 Offside and nearside rear brake back plates wet with axle oil Offside and nearside rear brake back plates wet with axle oil 19 April 2006 [16:46] 19/04/2006 342619306132 342619306132
1 Start of corrosion to nearside front underarch front and rear ends Start of corrosion to nearside front underarch front and rear ends 19 April 2006 [16:46] 19/04/2006 342619306132 342619306132

MOT TEST: 07 August 2007 08:51:42 PASSED
MOT TEST: 07 August 2007 08:51:42 PASSED

This test (181319817250) was completed on the 07 August 2007 08:51:42 and PASSED the requirements for a valid MOT with 0 comments.

This test (181319817250) was completed on the 07 August 2007 08:51:42 and PASSED the requirements for a valid MOT with 0 comments.

Recorded mileage: 60,045

Recorded mileage: 60,045


MOT TEST: 01 August 2007 17:16:54 FAILED
MOT TEST: 01 August 2007 17:16:54 FAILED

This test (314333717479) was completed on the 01 August 2007 17:16:54 and FAILED the requirements for a valid MOT with 7 comments.

This test (314333717479) was completed on the 01 August 2007 17:16:54 and FAILED the requirements for a valid MOT with 7 comments.

Recorded mileage: 60,045

Recorded mileage: 60,045


FAIL


MOT TEST: 19 April 2006 16:46:11 FAILED
MOT TEST: 19 April 2006 16:46:11 FAILED

This test (342619306132) was completed on the 19 April 2006 16:46:11 and FAILED the requirements for a valid MOT with 23 comments.

This test (342619306132) was completed on the 19 April 2006 16:46:11 and FAILED the requirements for a valid MOT with 23 comments.

Recorded mileage: 60,045

Recorded mileage: 60,045


ADVISORY

FAIL

USER ENTERED