922 XUF


922XUF is registered to a Black 1958, Morris Minor with a Petrol engine. It Failed its most recent MOT Test on the 09 April 2011

9 unique faults (9 Total) reported in its MOT History (7 Tests).

0 common/recurring faults.

71% (5) MOT Pass Rate and a 29% (2) MOT Failure Rate.

70,319 recorded miles.

922 XUF


922XUF is registered to a Black 1958, Morris Minor with a Petrol engine. It Failed its most recent MOT Test on the 09 April 2011

9 unique faults (9 Total) reported in its MOT History (7 Tests).

0 common/recurring faults.

71% (5) MOT Pass Rate and a 29% (2) MOT Failure Rate.

70,319 recorded miles.

MOT PASS/Failure rate for 922 XUF

all MOT test results for 922 XUF represented as a percentage
MOT PASS/Failure rate for 922 XUF
all MOT test results for 922 XUF represented as a percentage

PERCENTAGE OF VEHICLE FAULTS WITH 922 XUF

ALL REPORTED FAULTS, DISPLAYED BY PERCENTAGE OF OCCURRENCE DURING ALL MOT TESTS
PERCENTAGE OF VEHICLE FAULTS WITH 922 XUF
ALL REPORTED FAULTS, DISPLAYED BY PERCENTAGE OF OCCURRENCE DURING ALL MOT TESTS
ADVISORY

FAIL

USER ENTERED

922 XUF annual Faults by type

ALL REPORTED FAULTS, DISPLAYED over time and categorised by type
922 XUF annual Faults by type
ALL REPORTED FAULTS, DISPLAYED over time and categorised by type

ALL 922 XUF ADVISORIES [3]

ALL ADVISORIES, ORDERED by OCCURRENCE DURING 922 XUF's MOT HISTORY
ALL 922 XUF ADVISORIES [3]
ALL ADVISORIES, ORDERED by OCCURRENCE DURING 922 XUF's MOT HISTORY
Advisory Faults | source www.vehiclestats.co.uk
Fault Fault Test Date Test Date/Time Reference MOT Test Reference
1 Offside front wheel bearing has slight play (2.5.a.3c) Offside front wheel bearing has slight play (2.5.a.3c) 03 October 2007 [09:51] 03/10/2007 603086977226 603086977226
1 Front vehicle structure has slight corrosion (6.1.a.1) Front vehicle structure has slight corrosion (6.1.a.1) 25 September 2006 [14:49] 25/09/2006 762418566285 762418566285
1 Front brake disc slightly pitted (3.5.1h) Front brake disc slightly pitted (3.5.1h) 25 September 2006 [14:49] 25/09/2006 762418566285 762418566285

ALL 922 XUF Failure Faults [5]

ALL Failure faults, ORDERED by OCCURRENCE DURING 922 XUF's MOT HISTORY
ALL 922 XUF Failure Faults [5]
ALL Failure faults, ORDERED by OCCURRENCE DURING 922 XUF's MOT HISTORY
Fail Faults | source www.vehiclestats.co.uk
Fault Fault Test Date Test Date/Time Reference MOT Test Reference
1 Nearside rear stop lamp not working (1.2.1b) Nearside rear stop lamp not working (1.2.1b) 14 December 2009 [16:13] 14/12/2009 411938749390 411938749390
1 Nearside rear direction indicator not working (1.4.a.2c) Nearside rear direction indicator not working (1.4.a.2c) 14 December 2009 [16:13] 14/12/2009 411938749390 411938749390
1 Nearside rear rear brake recording little or no effort (3.7.b.5a) Nearside rear rear brake recording little or no effort (3.7.b.5a) 25 September 2006 [14:49] 25/09/2006 762418566285 762418566285
1 Nearside rear parking brake recording little or no effort (3.7.b.6a) Nearside rear parking brake recording little or no effort (3.7.b.6a) 25 September 2006 [14:49] 25/09/2006 762418566285 762418566285
1 Parking brake: efficiency below requirements (3.7.b.7) Parking brake: efficiency below requirements (3.7.b.7) 25 September 2006 [14:49] 25/09/2006 762418566285 762418566285

ALL 922 XUF User Entered Faults [1]

ALL User Entered faults, ORDERED by OCCURRENCE DURING 922 XUF's MOT HISTORY
ALL 922 XUF User Entered Faults [1]
ALL User Entered faults, ORDERED by OCCURRENCE DURING 922 XUF's MOT HISTORY
Fail Faults | source www.vehiclestats.co.uk
Fault Fault Test Date Test Date/Time Reference MOT Test Reference
1 Near side engine mounting bracket split. Near side engine mounting bracket split. 25 September 2006 [14:49] 25/09/2006 762418566285 762418566285

MOT TEST: 09 April 2011 13:38:39 PASSED
MOT TEST: 09 April 2011 13:38:39 PASSED

This test (185859691475) was completed on the 09 April 2011 13:38:39 and PASSED the requirements for a valid MOT with 0 comments.

This test (185859691475) was completed on the 09 April 2011 13:38:39 and PASSED the requirements for a valid MOT with 0 comments.

Recorded mileage: 70,319

Recorded mileage: 70,319


MOT TEST: 15 December 2009 14:45:07 PASSED
MOT TEST: 15 December 2009 14:45:07 PASSED

This test (123819249368) was completed on the 15 December 2009 14:45:07 and PASSED the requirements for a valid MOT with 0 comments.

This test (123819249368) was completed on the 15 December 2009 14:45:07 and PASSED the requirements for a valid MOT with 0 comments.

Recorded mileage: 69,449

Recorded mileage: 69,449


MOT TEST: 14 December 2009 16:13:21 FAILED
MOT TEST: 14 December 2009 16:13:21 FAILED

This test (411938749390) was completed on the 14 December 2009 16:13:21 and FAILED the requirements for a valid MOT with 2 comments.

This test (411938749390) was completed on the 14 December 2009 16:13:21 and FAILED the requirements for a valid MOT with 2 comments.

Recorded mileage: 69,449

Recorded mileage: 69,449


FAIL


MOT TEST: 16 December 2008 10:33:49 PASSED
MOT TEST: 16 December 2008 10:33:49 PASSED

This test (700041458362) was completed on the 16 December 2008 10:33:49 and PASSED the requirements for a valid MOT with 0 comments.

This test (700041458362) was completed on the 16 December 2008 10:33:49 and PASSED the requirements for a valid MOT with 0 comments.

Recorded mileage: 69,169

Recorded mileage: 69,169


MOT TEST: 03 October 2007 09:51:03 PASSED
MOT TEST: 03 October 2007 09:51:03 PASSED

This test (603086977226) was completed on the 03 October 2007 09:51:03 and PASSED the requirements for a valid MOT with 1 comments.

This test (603086977226) was completed on the 03 October 2007 09:51:03 and PASSED the requirements for a valid MOT with 1 comments.

Recorded mileage: 69,048

Recorded mileage: 69,048


ADVISORY


MOT TEST: 02 October 2006 11:28:35 PASSED
MOT TEST: 02 October 2006 11:28:35 PASSED

This test (484525776202) was completed on the 02 October 2006 11:28:35 and PASSED the requirements for a valid MOT with 0 comments.

This test (484525776202) was completed on the 02 October 2006 11:28:35 and PASSED the requirements for a valid MOT with 0 comments.

Recorded mileage: 68,901

Recorded mileage: 68,901


MOT TEST: 25 September 2006 14:49:32 FAILED
MOT TEST: 25 September 2006 14:49:32 FAILED

This test (762418566285) was completed on the 25 September 2006 14:49:32 and FAILED the requirements for a valid MOT with 6 comments.

This test (762418566285) was completed on the 25 September 2006 14:49:32 and FAILED the requirements for a valid MOT with 6 comments.

Recorded mileage: 68,895

Recorded mileage: 68,895


ADVISORY

FAIL

USER ENTERED