935 YUR


935YUR is registered to a Grey 1960, Morris Minor with a Petrol engine. It Failed its most recent MOT Test on the 10 April 2017

22 unique faults (22 Total) reported in its MOT History (5 Tests).

0 common/recurring faults.

60% (3) MOT Pass Rate and a 40% (2) MOT Failure Rate.

25,151 recorded miles.

935 YUR


935YUR is registered to a Grey 1960, Morris Minor with a Petrol engine. It Failed its most recent MOT Test on the 10 April 2017

22 unique faults (22 Total) reported in its MOT History (5 Tests).

0 common/recurring faults.

60% (3) MOT Pass Rate and a 40% (2) MOT Failure Rate.

25,151 recorded miles.

MOT PASS/Failure rate for 935 YUR

all MOT test results for 935 YUR represented as a percentage
MOT PASS/Failure rate for 935 YUR
all MOT test results for 935 YUR represented as a percentage

PERCENTAGE OF VEHICLE FAULTS WITH 935 YUR

ALL REPORTED FAULTS, DISPLAYED BY PERCENTAGE OF OCCURRENCE DURING ALL MOT TESTS
PERCENTAGE OF VEHICLE FAULTS WITH 935 YUR
ALL REPORTED FAULTS, DISPLAYED BY PERCENTAGE OF OCCURRENCE DURING ALL MOT TESTS
ADVISORY

FAIL

USER ENTERED

935 YUR annual Faults by type

ALL REPORTED FAULTS, DISPLAYED over time and categorised by type
935 YUR annual Faults by type
ALL REPORTED FAULTS, DISPLAYED over time and categorised by type

ALL 935 YUR ADVISORIES [2]

ALL ADVISORIES, ORDERED by OCCURRENCE DURING 935 YUR's MOT HISTORY
ALL 935 YUR ADVISORIES [2]
ALL ADVISORIES, ORDERED by OCCURRENCE DURING 935 YUR's MOT HISTORY
Fail Faults | source www.vehiclestats.co.uk
Fault Fault Test Date Test Date/Time Reference MOT Test Reference
1 Both front tyres perishing Both front tyres perishing 30 March 2017 [09:34] 30/03/2017 817004846150 817004846150
1 Front wheel bearing has slight play both front (2.5.a.3c) Front wheel bearing has slight play both front (2.5.a.3c) 30 March 2017 [09:34] 30/03/2017 817004846150 817004846150

ALL 935 YUR Failure Faults [18]

ALL Failure faults, ORDERED by OCCURRENCE DURING 935 YUR's MOT HISTORY
ALL 935 YUR Failure Faults [18]
ALL Failure faults, ORDERED by OCCURRENCE DURING 935 YUR's MOT HISTORY
Fail Faults | source www.vehiclestats.co.uk
Fault Fault Test Date Test Date/Time Reference MOT Test Reference
1 Nearside headlamp aim too high (1.8) Nearside headlamp aim too high (1.8) 30 March 2017 [09:34] 30/03/2017 817004846150 817004846150
1 Offside headlamp aim too high (1.8) Offside headlamp aim too high (1.8) 30 March 2017 [09:34] 30/03/2017 817004846150 817004846150
1 Rear brake pipe leaking center to fexi hose (3.6.a.1) Rear brake pipe leaking center to fexi hose (3.6.a.1) 30 March 2017 [09:34] 30/03/2017 817004846150 817004846150
1 Nearside rear mechanical brake component has restricted free movement (3.5.1k) Nearside rear mechanical brake component has restricted free movement (3.5.1k) 30 March 2017 [09:34] 30/03/2017 817004846150 817004846150
1 Nearside front front wheel bearing rough when rotated (2.5.a.2) Nearside front front wheel bearing rough when rotated (2.5.a.2) 30 March 2017 [09:34] 30/03/2017 817004846150 817004846150
1 Offside front front wheel bearing rough when rotated (2.5.a.2) Offside front front wheel bearing rough when rotated (2.5.a.2) 30 March 2017 [09:34] 30/03/2017 817004846150 817004846150
1 Direction indicators not working (1.4.a.2c) Direction indicators not working (1.4.a.2c) 02 February 2013 [10:34] 02/02/2013 117013933493 117013933493
1 Nearside stop lamp not working (1.2.1b) Nearside stop lamp not working (1.2.1b) 02 February 2013 [10:34] 02/02/2013 117013933493 117013933493
1 Offside stop lamp not working (1.2.1b) Offside stop lamp not working (1.2.1b) 02 February 2013 [10:34] 02/02/2013 117013933493 117013933493
1 Nearside windscreen wiper not operating automatically when switched on (8.2.1b) Nearside windscreen wiper not operating automatically when switched on (8.2.1b) 02 February 2013 [10:34] 02/02/2013 117013933493 117013933493
1 Offside windscreen wiper not operating automatically when switched on (8.2.1b) Offside windscreen wiper not operating automatically when switched on (8.2.1b) 02 February 2013 [10:34] 02/02/2013 117013933493 117013933493
1 Windscreen washer provides insufficient washer liquid (8.2.3) Windscreen washer provides insufficient washer liquid (8.2.3) 02 February 2013 [10:34] 02/02/2013 117013933493 117013933493
1 Brake pedal spongy (3.3.b.1b) Brake pedal spongy (3.3.b.1b) 02 February 2013 [10:34] 02/02/2013 117013933493 117013933493
1 Nearside rear brake recording little or no effort (3.7.b.5a) Nearside rear brake recording little or no effort (3.7.b.5a) 02 February 2013 [10:34] 02/02/2013 117013933493 117013933493
1 Offside rear brake recording little or no effort (3.7.b.5a) Offside rear brake recording little or no effort (3.7.b.5a) 02 February 2013 [10:34] 02/02/2013 117013933493 117013933493
1 Nearside rear parking brake recording little or no effort (3.7.b.6a) Nearside rear parking brake recording little or no effort (3.7.b.6a) 02 February 2013 [10:34] 02/02/2013 117013933493 117013933493
1 Service brake: efficiency below requirements (3.7.b.7) Service brake: efficiency below requirements (3.7.b.7) 02 February 2013 [10:34] 02/02/2013 117013933493 117013933493
1 Parking brake: efficiency below requirements (3.7.b.7) Parking brake: efficiency below requirements (3.7.b.7) 02 February 2013 [10:34] 02/02/2013 117013933493 117013933493

ALL 935 YUR User Entered Faults [2]

ALL User Entered faults, ORDERED by OCCURRENCE DURING 935 YUR's MOT HISTORY
ALL 935 YUR User Entered Faults [2]
ALL User Entered faults, ORDERED by OCCURRENCE DURING 935 YUR's MOT HISTORY
User Entered Faults | source www.vehiclestats.co.uk
Fault Fault Test Date Test Date/Time Reference MOT Test Reference
1 All tyres low and cracked All tyres low and cracked 05 February 2013 [13:47] 05/02/2013 818596533002 818596533002
1 Battery insecure Battery insecure 02 February 2013 [10:34] 02/02/2013 117013933493 117013933493

MOT TEST: 10 April 2017 14:43:38 PASSED
MOT TEST: 10 April 2017 14:43:38 PASSED

This test (723425186325) was completed on the 10 April 2017 14:43:38 and PASSED the requirements for a valid MOT with 0 comments.

This test (723425186325) was completed on the 10 April 2017 14:43:38 and PASSED the requirements for a valid MOT with 0 comments.

Recorded mileage: 25,151

Recorded mileage: 25,151


MOT TEST: 30 March 2017 09:34:08 FAILED
MOT TEST: 30 March 2017 09:34:08 FAILED

This test (817004846150) was completed on the 30 March 2017 09:34:08 and FAILED the requirements for a valid MOT with 8 comments.

This test (817004846150) was completed on the 30 March 2017 09:34:08 and FAILED the requirements for a valid MOT with 8 comments.

Recorded mileage: 25,142

Recorded mileage: 25,142


ADVISORY

FAIL


MOT TEST: 10 April 2015 09:37:36 PASSED
MOT TEST: 10 April 2015 09:37:36 PASSED

This test (546780205173) was completed on the 10 April 2015 09:37:36 and PASSED the requirements for a valid MOT with 0 comments.

This test (546780205173) was completed on the 10 April 2015 09:37:36 and PASSED the requirements for a valid MOT with 0 comments.

Recorded mileage: 25,110

Recorded mileage: 25,110


MOT TEST: 05 February 2013 13:47:42 PASSED
MOT TEST: 05 February 2013 13:47:42 PASSED

This test (818596533002) was completed on the 05 February 2013 13:47:42 and PASSED the requirements for a valid MOT with 1 comments.

This test (818596533002) was completed on the 05 February 2013 13:47:42 and PASSED the requirements for a valid MOT with 1 comments.

Recorded mileage: 25,068

Recorded mileage: 25,068


USER ENTERED


MOT TEST: 02 February 2013 10:34:42 FAILED
MOT TEST: 02 February 2013 10:34:42 FAILED

This test (117013933493) was completed on the 02 February 2013 10:34:42 and FAILED the requirements for a valid MOT with 13 comments.

This test (117013933493) was completed on the 02 February 2013 10:34:42 and FAILED the requirements for a valid MOT with 13 comments.

Recorded mileage: 25,064

Recorded mileage: 25,064


FAIL

USER ENTERED