947 YUA


947YUA is registered to a Grey 1959, Morris Minor with a Petrol engine. It Failed its most recent MOT Test on the 16 October 2010

28 unique faults (29 Total) reported in its MOT History (11 Tests).

1 common/recurring faults.

55% (6) MOT Pass Rate and a 45% (5) MOT Failure Rate.

47,225 recorded miles.

947 YUA


947YUA is registered to a Grey 1959, Morris Minor with a Petrol engine. It Failed its most recent MOT Test on the 16 October 2010

28 unique faults (29 Total) reported in its MOT History (11 Tests).

1 common/recurring faults.

55% (6) MOT Pass Rate and a 45% (5) MOT Failure Rate.

47,225 recorded miles.

MOT PASS/Failure rate for 947 YUA

all MOT test results for 947 YUA represented as a percentage
MOT PASS/Failure rate for 947 YUA
all MOT test results for 947 YUA represented as a percentage

PERCENTAGE OF VEHICLE FAULTS WITH 947 YUA

ALL REPORTED FAULTS, DISPLAYED BY PERCENTAGE OF OCCURRENCE DURING ALL MOT TESTS
PERCENTAGE OF VEHICLE FAULTS WITH 947 YUA
ALL REPORTED FAULTS, DISPLAYED BY PERCENTAGE OF OCCURRENCE DURING ALL MOT TESTS
ADVISORY

FAIL

USER ENTERED

947 YUA annual Faults by type

ALL REPORTED FAULTS, DISPLAYED over time and categorised by type
947 YUA annual Faults by type
ALL REPORTED FAULTS, DISPLAYED over time and categorised by type

ALL 947 YUA ADVISORIES [1]

ALL ADVISORIES, ORDERED by OCCURRENCE DURING 947 YUA's MOT HISTORY
ALL 947 YUA ADVISORIES [1]
ALL ADVISORIES, ORDERED by OCCURRENCE DURING 947 YUA's MOT HISTORY
Fail Faults | source www.vehiclestats.co.uk
Fault Fault Test Date Test Date/Time Reference MOT Test Reference
1 Exhaust emits blue smoke during acceleration (7.3.a.2c) Exhaust emits blue smoke during acceleration (7.3.a.2c) 27 November 2009 [13:18] 27/11/2009 820421939312 820421939312

ALL 947 YUA Failure Faults [26]

ALL Failure faults, ORDERED by OCCURRENCE DURING 947 YUA's MOT HISTORY
ALL 947 YUA Failure Faults [26]
ALL Failure faults, ORDERED by OCCURRENCE DURING 947 YUA's MOT HISTORY
Fail Faults | source www.vehiclestats.co.uk
Fault Fault Test Date Test Date/Time Reference MOT Test Reference
1 Horn not working (1.6.2a) Horn not working (1.6.2a) 11 October 2010 [15:50] 11/10/2010 361284080446 361284080446
1 Nearside headlamp excessively deteriorated so that the light output is severely reduced (1.7.5a) Nearside headlamp excessively deteriorated so that the light output is severely reduced (1.7.5a) 11 October 2010 [15:50] 11/10/2010 361284080446 361284080446
1 Nearside front brake binding (3.7.b.1) Nearside front brake binding (3.7.b.1) 11 October 2010 [15:50] 11/10/2010 361284080446 361284080446
1 Brakes imbalanced across an axle (3.7.b.5b) Brakes imbalanced across an axle (3.7.b.5b) 11 October 2010 [15:50] 11/10/2010 361284080446 361284080446
1 Offside steering rack gaiter split (2.2.d.2d) Offside steering rack gaiter split (2.2.d.2d) 27 November 2009 [13:18] 27/11/2009 820421939312 820421939312
1 Registration plate lamp not working (1.1.5c) Registration plate lamp not working (1.1.5c) 27 November 2009 [13:18] 27/11/2009 820421939312 820421939312
1 Nearside front wheel bearing rough when rotated (2.5.a.2) Nearside front wheel bearing rough when rotated (2.5.a.2) 27 November 2009 [13:18] 27/11/2009 820421939312 820421939312
1 Brake pedal spongy (3.3.b.1b) Brake pedal spongy (3.3.b.1b) 01 December 2007 [10:57] 01/12/2007 261365637380 261365637380
1 Offside rear parking brake recording little or no effort (3.7.b.6a) Offside rear parking brake recording little or no effort (3.7.b.6a) 01 December 2007 [10:57] 01/12/2007 261365637380 261365637380
1 Offside rear brake application uneven (3.7.b.2) Offside rear brake application uneven (3.7.b.2) 01 December 2007 [10:57] 01/12/2007 261365637380 261365637380
1 Offside rear brake binding (3.7.b.1) Offside rear brake binding (3.7.b.1) 01 December 2007 [10:57] 01/12/2007 261365637380 261365637380
1 Parking brake: efficiency below requirements (3.7.b.7) Parking brake: efficiency below requirements (3.7.b.7) 01 December 2007 [10:57] 01/12/2007 261365637380 261365637380
1 Offside front shock absorber has a serious fluid leak (2.7.3) Offside front shock absorber has a serious fluid leak (2.7.3) 24 November 2006 [14:00] 24/11/2006 880758926311 880758926311
1 Nearside rear shock absorber has a serious fluid leak (2.7.3) Nearside rear shock absorber has a serious fluid leak (2.7.3) 24 November 2006 [14:00] 24/11/2006 880758926311 880758926311
1 Nearside front upper front suspension has a suspension upper ball joint securing nut not locked (2.5.b.1a) Nearside front upper front suspension has a suspension upper ball joint securing nut not locked (2.5.b.1a) 24 November 2006 [14:00] 24/11/2006 880758926311 880758926311
1 Offside front front suspension has a suspension upper ball joint securing nut not locked (2.5.b.1a) Offside front front suspension has a suspension upper ball joint securing nut not locked (2.5.b.1a) 24 November 2006 [14:00] 24/11/2006 880758926311 880758926311
1 Nearside front front wheel bearing rough when rotated (2.5.a.2) Nearside front front wheel bearing rough when rotated (2.5.a.2) 24 November 2006 [14:00] 24/11/2006 880758926311 880758926311
1 Nearside headlamp aim too low (1.8) Nearside headlamp aim too low (1.8) 24 November 2006 [14:00] 24/11/2006 880758926311 880758926311
1 Nearside front front brake binding (3.7.b.1) Nearside front front brake binding (3.7.b.1) 10 December 2005 [08:58] 10/12/2005 474534645330 474534645330
1 Offside front front brake binding (3.7.b.1) Offside front front brake binding (3.7.b.1) 10 December 2005 [08:58] 10/12/2005 474534645330 474534645330
1 Nearside rear front brake binding (3.7.b.1) Nearside rear front brake binding (3.7.b.1) 10 December 2005 [08:58] 10/12/2005 474534645330 474534645330
1 Offside rear front brake binding (3.7.b.1) Offside rear front brake binding (3.7.b.1) 10 December 2005 [08:58] 10/12/2005 474534645330 474534645330
1 An item not tested (manual) An item not tested (manual) 10 December 2005 [08:58] 10/12/2005 474534645330 474534645330
1 Nearside front passenger door cannot be opened from inside the vehicle (6.2.b.1b) Nearside front passenger door cannot be opened from inside the vehicle (6.2.b.1b) 10 December 2005 [08:58] 10/12/2005 474534645330 474534645330
1 Nearside front passenger door cannot be opened from outside the vehicle (6.2.b.1b) Nearside front passenger door cannot be opened from outside the vehicle (6.2.b.1b) 10 December 2005 [08:58] 10/12/2005 474534645330 474534645330
1 Windscreen washer provides insufficient washer liquid (8.2.3) Windscreen washer provides insufficient washer liquid (8.2.3) 10 December 2005 [08:58] 10/12/2005 474534645330 474534645330

ALL 947 YUA User Entered Faults [2]

ALL User Entered faults, ORDERED by OCCURRENCE DURING 947 YUA's MOT HISTORY
ALL 947 YUA User Entered Faults [2]
ALL User Entered faults, ORDERED by OCCURRENCE DURING 947 YUA's MOT HISTORY
User Entered Faults | source www.vehiclestats.co.uk
Fault Fault Test Date Test Date/Time Reference MOT Test Reference
2 Sharp edge forming on nearside front wing Sharp edge forming on nearside front wing 16 October 2010 [09:16] 16/10/2010 11 October 2010 [15:50] 11/10/2010 682969080293 682969080293 361284080446 361284080446

MOT TEST: 16 October 2010 09:16:55 PASSED
MOT TEST: 16 October 2010 09:16:55 PASSED

This test (682969080293) was completed on the 16 October 2010 09:16:55 and PASSED the requirements for a valid MOT with 1 comments.

This test (682969080293) was completed on the 16 October 2010 09:16:55 and PASSED the requirements for a valid MOT with 1 comments.

Recorded mileage: 47,225

Recorded mileage: 47,225


USER ENTERED


MOT TEST: 11 October 2010 15:50:32 FAILED
MOT TEST: 11 October 2010 15:50:32 FAILED

This test (361284080446) was completed on the 11 October 2010 15:50:32 and FAILED the requirements for a valid MOT with 5 comments.

This test (361284080446) was completed on the 11 October 2010 15:50:32 and FAILED the requirements for a valid MOT with 5 comments.

Recorded mileage: 47,207

Recorded mileage: 47,207


FAIL

USER ENTERED


MOT TEST: 07 December 2009 15:54:21 PASSED
MOT TEST: 07 December 2009 15:54:21 PASSED

This test (700771849308) was completed on the 07 December 2009 15:54:21 and PASSED the requirements for a valid MOT with 0 comments.

This test (700771849308) was completed on the 07 December 2009 15:54:21 and PASSED the requirements for a valid MOT with 0 comments.

Recorded mileage: 45,538

Recorded mileage: 45,538


MOT TEST: 27 November 2009 13:18:06 FAILED
MOT TEST: 27 November 2009 13:18:06 FAILED

This test (820421939312) was completed on the 27 November 2009 13:18:06 and FAILED the requirements for a valid MOT with 4 comments.

This test (820421939312) was completed on the 27 November 2009 13:18:06 and FAILED the requirements for a valid MOT with 4 comments.

Recorded mileage: 45,499

Recorded mileage: 45,499


ADVISORY

FAIL


MOT TEST: 28 November 2008 13:16:51 PASSED
MOT TEST: 28 November 2008 13:16:51 PASSED

This test (460793038329) was completed on the 28 November 2008 13:16:51 and PASSED the requirements for a valid MOT with 0 comments.

This test (460793038329) was completed on the 28 November 2008 13:16:51 and PASSED the requirements for a valid MOT with 0 comments.

Recorded mileage: 43,492

Recorded mileage: 43,492


MOT TEST: 07 December 2007 14:56:59 PASSED
MOT TEST: 07 December 2007 14:56:59 PASSED

This test (104911347354) was completed on the 07 December 2007 14:56:59 and PASSED the requirements for a valid MOT with 0 comments.

This test (104911347354) was completed on the 07 December 2007 14:56:59 and PASSED the requirements for a valid MOT with 0 comments.

Recorded mileage: 41,833

Recorded mileage: 41,833


MOT TEST: 01 December 2007 10:57:57 FAILED
MOT TEST: 01 December 2007 10:57:57 FAILED

This test (261365637380) was completed on the 01 December 2007 10:57:57 and FAILED the requirements for a valid MOT with 5 comments.

This test (261365637380) was completed on the 01 December 2007 10:57:57 and FAILED the requirements for a valid MOT with 5 comments.

Recorded mileage: 41,806

Recorded mileage: 41,806


FAIL


MOT TEST: 11 December 2006 11:42:08 PASSED
MOT TEST: 11 December 2006 11:42:08 PASSED

This test (561435846330) was completed on the 11 December 2006 11:42:08 and PASSED the requirements for a valid MOT with 0 comments.

This test (561435846330) was completed on the 11 December 2006 11:42:08 and PASSED the requirements for a valid MOT with 0 comments.

Recorded mileage: 39,184

Recorded mileage: 39,184


MOT TEST: 24 November 2006 14:00:37 FAILED
MOT TEST: 24 November 2006 14:00:37 FAILED

This test (880758926311) was completed on the 24 November 2006 14:00:37 and FAILED the requirements for a valid MOT with 6 comments.

This test (880758926311) was completed on the 24 November 2006 14:00:37 and FAILED the requirements for a valid MOT with 6 comments.

Recorded mileage: 39,002

Recorded mileage: 39,002


FAIL


MOT TEST: 19 December 2005 16:21:43 PASSED
MOT TEST: 19 December 2005 16:21:43 PASSED

This test (973683855358) was completed on the 19 December 2005 16:21:43 and PASSED the requirements for a valid MOT with 0 comments.

This test (973683855358) was completed on the 19 December 2005 16:21:43 and PASSED the requirements for a valid MOT with 0 comments.

Recorded mileage: 38,002

Recorded mileage: 38,002


MOT TEST: 10 December 2005 08:58:40 FAILED
MOT TEST: 10 December 2005 08:58:40 FAILED

This test (474534645330) was completed on the 10 December 2005 08:58:40 and FAILED the requirements for a valid MOT with 8 comments.

This test (474534645330) was completed on the 10 December 2005 08:58:40 and FAILED the requirements for a valid MOT with 8 comments.

Recorded mileage: 37,989

Recorded mileage: 37,989


FAIL