A24 TNK


A24TNK is registered to a Red 1984, Morris 575 with a Petrol engine. It Failed its most recent MOT Test on the 25 January 2012

13 unique faults (17 Total) reported in its MOT History (8 Tests).

2 common/recurring faults, the most frequent (3 times) is: Vehicle structure has slight corrosion (6.1.A.1).

75% (6) MOT Pass Rate and a 25% (2) MOT Failure Rate.

80,763 recorded miles.

A24 TNK


A24TNK is registered to a Red 1984, Morris 575 with a Petrol engine. It Failed its most recent MOT Test on the 25 January 2012

13 unique faults (17 Total) reported in its MOT History (8 Tests).

2 common/recurring faults, the most frequent (3 times) is: Vehicle structure has slight corrosion (6.1.A.1).

75% (6) MOT Pass Rate and a 25% (2) MOT Failure Rate.

80,763 recorded miles.

MOT PASS/Failure rate for A24 TNK

all MOT test results for A24 TNK represented as a percentage
MOT PASS/Failure rate for A24 TNK
all MOT test results for A24 TNK represented as a percentage

PERCENTAGE OF VEHICLE FAULTS WITH A24 TNK

ALL REPORTED FAULTS, DISPLAYED BY PERCENTAGE OF OCCURRENCE DURING ALL MOT TESTS
PERCENTAGE OF VEHICLE FAULTS WITH A24 TNK
ALL REPORTED FAULTS, DISPLAYED BY PERCENTAGE OF OCCURRENCE DURING ALL MOT TESTS
ADVISORY

FAIL

A24 TNK annual Faults by type

ALL REPORTED FAULTS, DISPLAYED over time and categorised by type
A24 TNK annual Faults by type
ALL REPORTED FAULTS, DISPLAYED over time and categorised by type

RECURRING FAULTS WITH A24 TNK

FAULTS THAT HAVE OCCURED MORE THAN ONCE DURING A24 TNK's MOT HISTORY
RECURRING FAULTS WITH A24 TNK
FAULTS THAT HAVE OCCURED MORE THAN ONCE DURING A24 TNK's MOT HISTORY
Fault Fault Test Date Test Date/Time Reference MOT Test Reference
3 Vehicle structure has slight corrosion (6.1.a.1) Vehicle structure has slight corrosion (6.1.a.1) 25 January 2012 [15:49] 25/01/2012 06 January 2011 [16:40] 06/01/2011 06 January 2011 [14:49] 06/01/2011 597295222049 597295222049 367076201037 367076201037 515666601073 515666601073
3 Body has slight corrosion (6.1.b.2) Body has slight corrosion (6.1.b.2) 25 January 2012 [15:49] 25/01/2012 06 January 2011 [16:40] 06/01/2011 06 January 2011 [14:49] 06/01/2011 597295222049 597295222049 367076201037 367076201037 515666601073 515666601073

ALL A24 TNK ADVISORIES [11]

ALL ADVISORIES, ORDERED by OCCURRENCE DURING A24 TNK's MOT HISTORY
ALL A24 TNK ADVISORIES [11]
ALL ADVISORIES, ORDERED by OCCURRENCE DURING A24 TNK's MOT HISTORY
Advisory Faults | source www.vehiclestats.co.uk
Fault Fault Test Date Test Date/Time Reference MOT Test Reference
3 Vehicle structure has slight corrosion (6.1.a.1) Vehicle structure has slight corrosion (6.1.a.1) 25 January 2012 [15:49] 25/01/2012 06 January 2011 [16:40] 06/01/2011 06 January 2011 [14:49] 06/01/2011 597295222049 597295222049 367076201037 367076201037 515666601073 515666601073
3 Body has slight corrosion (6.1.b.2) Body has slight corrosion (6.1.b.2) 25 January 2012 [15:49] 25/01/2012 06 January 2011 [16:40] 06/01/2011 06 January 2011 [14:49] 06/01/2011 597295222049 597295222049 367076201037 367076201037 515666601073 515666601073
1 Front registration plate deteriorated but not likely to be misread (6.3.1d) Front registration plate deteriorated but not likely to be misread (6.3.1d) 25 January 2012 [15:49] 25/01/2012 597295222049 597295222049
1 Vehicle structure has slight corrosion (6.1.b.2) Vehicle structure has slight corrosion (6.1.b.2) 30 December 2009 [11:39] 30/12/2009 222044769392 222044769392
1 Offside body has slight corrosion (6.1.b.2) Offside body has slight corrosion (6.1.b.2) 30 December 2009 [11:39] 30/12/2009 222044769392 222044769392
1 Nearside front upper steering pivot point has slight play (2.2.b.1g) Nearside front upper steering pivot point has slight play (2.2.b.1g) 30 December 2009 [11:39] 30/12/2009 222044769392 222044769392
1 Parking brake: parking brake efficiency only just met. It would appear that the braking system requires adjustment or repair. (3.7.b.7) Parking brake: parking brake efficiency only just met. It would appear that the braking system requires adjustment or repair. (3.7.b.7) 30 December 2009 [11:39] 30/12/2009 222044769392 222044769392

ALL A24 TNK Failure Faults [6]

ALL Failure faults, ORDERED by OCCURRENCE DURING A24 TNK's MOT HISTORY
ALL A24 TNK Failure Faults [6]
ALL Failure faults, ORDERED by OCCURRENCE DURING A24 TNK's MOT HISTORY
Fail Faults | source www.vehiclestats.co.uk
Fault Fault Test Date Test Date/Time Reference MOT Test Reference
1 Nearside rear suspension spring mounting prescribed area is excessively corroded (2.4.a.3) Nearside rear suspension spring mounting prescribed area is excessively corroded (2.4.a.3) 24 January 2012 [15:06] 24/01/2012 575064022027 575064022027
1 Offside rear body or chassis has excessive corrosion, seriously affecting its strength within 30cm of the body mountings (6.1.b.2) Offside rear body or chassis has excessive corrosion, seriously affecting its strength within 30cm of the body mountings (6.1.b.2) 24 January 2012 [15:06] 24/01/2012 575064022027 575064022027
1 Front vehicle structure has excessive corrosion, seriously affecting its strength within 30cm of the body mountings (6.1.b.2) Front vehicle structure has excessive corrosion, seriously affecting its strength within 30cm of the body mountings (6.1.b.2) 24 January 2012 [15:06] 24/01/2012 575064022027 575064022027
1 Nearside headlamp insecure (1.7.3) Nearside headlamp insecure (1.7.3) 24 January 2012 [15:06] 24/01/2012 575064022027 575064022027
1 Headlamp not working on dipped beam (1.7.5a) Headlamp not working on dipped beam (1.7.5a) 24 January 2012 [15:06] 24/01/2012 575064022027 575064022027
1 Nearside front vehicle structure has excessive corrosion, seriously affecting its strength within 30cm of the body mountings (6.1.b.2) Nearside front vehicle structure has excessive corrosion, seriously affecting its strength within 30cm of the body mountings (6.1.b.2) 06 January 2011 [14:49] 06/01/2011 515666601073 515666601073

MOT TEST: 25 January 2012 15:49:27 PASSED
MOT TEST: 25 January 2012 15:49:27 PASSED

This test (597295222049) was completed on the 25 January 2012 15:49:27 and PASSED the requirements for a valid MOT with 3 comments.

This test (597295222049) was completed on the 25 January 2012 15:49:27 and PASSED the requirements for a valid MOT with 3 comments.

Recorded mileage: 80,763

Recorded mileage: 80,763


ADVISORY


MOT TEST: 24 January 2012 15:06:32 FAILED
MOT TEST: 24 January 2012 15:06:32 FAILED

This test (575064022027) was completed on the 24 January 2012 15:06:32 and FAILED the requirements for a valid MOT with 5 comments.

This test (575064022027) was completed on the 24 January 2012 15:06:32 and FAILED the requirements for a valid MOT with 5 comments.

Recorded mileage: 80,763

Recorded mileage: 80,763


FAIL


MOT TEST: 06 January 2011 16:40:06 PASSED
MOT TEST: 06 January 2011 16:40:06 PASSED

This test (367076201037) was completed on the 06 January 2011 16:40:06 and PASSED the requirements for a valid MOT with 2 comments.

This test (367076201037) was completed on the 06 January 2011 16:40:06 and PASSED the requirements for a valid MOT with 2 comments.

Recorded mileage: 80,331

Recorded mileage: 80,331


ADVISORY


MOT TEST: 06 January 2011 14:49:36 FAILED
MOT TEST: 06 January 2011 14:49:36 FAILED

This test (515666601073) was completed on the 06 January 2011 14:49:36 and FAILED the requirements for a valid MOT with 3 comments.

This test (515666601073) was completed on the 06 January 2011 14:49:36 and FAILED the requirements for a valid MOT with 3 comments.

Recorded mileage: 80,331

Recorded mileage: 80,331


ADVISORY

FAIL


MOT TEST: 30 December 2009 11:39:32 PASSED
MOT TEST: 30 December 2009 11:39:32 PASSED

This test (222044769392) was completed on the 30 December 2009 11:39:32 and PASSED the requirements for a valid MOT with 4 comments.

This test (222044769392) was completed on the 30 December 2009 11:39:32 and PASSED the requirements for a valid MOT with 4 comments.

Recorded mileage: 79,088

Recorded mileage: 79,088


ADVISORY


MOT TEST: 05 November 2008 15:03:38 PASSED
MOT TEST: 05 November 2008 15:03:38 PASSED

This test (451520418444) was completed on the 05 November 2008 15:03:38 and PASSED the requirements for a valid MOT with 0 comments.

This test (451520418444) was completed on the 05 November 2008 15:03:38 and PASSED the requirements for a valid MOT with 0 comments.

Recorded mileage: 75,912

Recorded mileage: 75,912


MOT TEST: 06 November 2007 15:42:15 PASSED
MOT TEST: 06 November 2007 15:42:15 PASSED

This test (560940617314) was completed on the 06 November 2007 15:42:15 and PASSED the requirements for a valid MOT with 0 comments.

This test (560940617314) was completed on the 06 November 2007 15:42:15 and PASSED the requirements for a valid MOT with 0 comments.

Recorded mileage: 68,538

Recorded mileage: 68,538


MOT TEST: 01 November 2006 14:46:12 PASSED
MOT TEST: 01 November 2006 14:46:12 PASSED

This test (480825006364) was completed on the 01 November 2006 14:46:12 and PASSED the requirements for a valid MOT with 0 comments.

This test (480825006364) was completed on the 01 November 2006 14:46:12 and PASSED the requirements for a valid MOT with 0 comments.

Recorded mileage: 62,907

Recorded mileage: 62,907