A885 SHM


A885SHM is registered to a Yellow 1984, Morris 440 with a Petrol engine. It Passed its most recent MOT Test on the 28 September 2018

34 unique faults (39 Total) reported in its MOT History (18 Tests).

3 common/recurring faults, the most frequent (2 times) is: Front Brake pad(s) wearing thin (3.5.1g).

72% (13) MOT Pass Rate and a 28% (5) MOT Failure Rate.

121,000 recorded miles.

A885 SHM


A885SHM is registered to a Yellow 1984, Morris 440 with a Petrol engine. It Passed its most recent MOT Test on the 28 September 2018

34 unique faults (39 Total) reported in its MOT History (18 Tests).

3 common/recurring faults, the most frequent (2 times) is: Front Brake pad(s) wearing thin (3.5.1g).

72% (13) MOT Pass Rate and a 28% (5) MOT Failure Rate.

121,000 recorded miles.

MOT PASS/Failure rate for A885 SHM

all MOT test results for A885 SHM represented as a percentage
MOT PASS/Failure rate for A885 SHM
all MOT test results for A885 SHM represented as a percentage

PERCENTAGE OF VEHICLE FAULTS WITH A885 SHM

ALL REPORTED FAULTS, DISPLAYED BY PERCENTAGE OF OCCURRENCE DURING ALL MOT TESTS
PERCENTAGE OF VEHICLE FAULTS WITH A885 SHM
ALL REPORTED FAULTS, DISPLAYED BY PERCENTAGE OF OCCURRENCE DURING ALL MOT TESTS
ADVISORY

FAIL

A885 SHM annual Faults by type

ALL REPORTED FAULTS, DISPLAYED over time and categorised by type
A885 SHM annual Faults by type
ALL REPORTED FAULTS, DISPLAYED over time and categorised by type

RECURRING FAULTS WITH A885 SHM

FAULTS THAT HAVE OCCURED MORE THAN ONCE DURING A885 SHM's MOT HISTORY
RECURRING FAULTS WITH A885 SHM
FAULTS THAT HAVE OCCURED MORE THAN ONCE DURING A885 SHM's MOT HISTORY
Fault Fault Test Date Test Date/Time Reference MOT Test Reference
2 Front brake pad(s) wearing thin (3.5.1g) Front brake pad(s) wearing thin (3.5.1g) 28 July 2016 [15:19] 28/07/2016 03 July 2007 [08:46] 03/07/2007 754587685627 754587685627 211704187148 211704187148
2 Offside rear subframe mounting prescribed area is excessively corroded (2.4.a.3) Offside rear subframe mounting prescribed area is excessively corroded (2.4.a.3) 16 July 2015 [16:15] 16/07/2015 10 July 2012 [17:05] 10/07/2012 398687995169 398687995169 327922592177 327922592177
2 Nearside seat belt anchorage prescribed area is excessively corroded (5.2.6) Nearside seat belt anchorage prescribed area is excessively corroded (5.2.6) 16 July 2015 [16:15] 16/07/2015 10 July 2012 [17:05] 10/07/2012 398687995169 398687995169 327922592177 327922592177

ALL A885 SHM ADVISORIES [10]

ALL ADVISORIES, ORDERED by OCCURRENCE DURING A885 SHM's MOT HISTORY
ALL A885 SHM ADVISORIES [10]
ALL ADVISORIES, ORDERED by OCCURRENCE DURING A885 SHM's MOT HISTORY
Advisory Faults | source www.vehiclestats.co.uk
Fault Fault Test Date Test Date/Time Reference MOT Test Reference
2 Front brake pad(s) wearing thin (3.5.1g) Front brake pad(s) wearing thin (3.5.1g) 28 July 2016 [15:19] 28/07/2016 03 July 2007 [08:46] 03/07/2007 754587685627 754587685627 211704187148 211704187148
1 Nearside front brake hose slightly deteriorated (3.6.b.4d) Nearside front brake hose slightly deteriorated (3.6.b.4d) 28 July 2016 [15:19] 28/07/2016 754587685627 754587685627
1 Offside front brake hose slightly deteriorated (3.6.b.4d) Offside front brake hose slightly deteriorated (3.6.b.4d) 28 July 2016 [15:19] 28/07/2016 754587685627 754587685627
1 Nearside front lower suspension arm has slight play in a pin/bush (2.4.g.2) Nearside front lower suspension arm has slight play in a pin/bush (2.4.g.2) 18 July 2011 [16:33] 18/07/2011 239359191471 239359191471
1 Offside front upper suspension arm has slight play in a pin/bush (2.4.g.2) Offside front upper suspension arm has slight play in a pin/bush (2.4.g.2) 18 July 2011 [16:33] 18/07/2011 239359191471 239359191471
1 Nearside front wheel bearing has slight play (2.5.a.3c) Nearside front wheel bearing has slight play (2.5.a.3c) 18 July 2011 [16:33] 18/07/2011 239359191471 239359191471
1 Front brake hose slightly deteriorated (3.6.b.4d) Front brake hose slightly deteriorated (3.6.b.4d) 03 July 2007 [08:46] 03/07/2007 211704187148 211704187148
1 Exhaust has a minor leak of exhaust gases (7.1.2) Exhaust has a minor leak of exhaust gases (7.1.2) 03 July 2007 [08:46] 03/07/2007 211704187148 211704187148
1 Nearside front tyre worn close to the legal limit (4.1.e.1) Nearside front tyre worn close to the legal limit (4.1.e.1) 03 July 2007 [08:46] 03/07/2007 211704187148 211704187148

ALL A885 SHM Failure Faults [29]

ALL Failure faults, ORDERED by OCCURRENCE DURING A885 SHM's MOT HISTORY
ALL A885 SHM Failure Faults [29]
ALL Failure faults, ORDERED by OCCURRENCE DURING A885 SHM's MOT HISTORY
Fail Faults | source www.vehiclestats.co.uk
Fault Fault Test Date Test Date/Time Reference MOT Test Reference
2 Offside rear subframe mounting prescribed area is excessively corroded (2.4.a.3) Offside rear subframe mounting prescribed area is excessively corroded (2.4.a.3) 16 July 2015 [16:15] 16/07/2015 10 July 2012 [17:05] 10/07/2012 398687995169 398687995169 327922592177 327922592177
2 Nearside seat belt anchorage prescribed area is excessively corroded (5.2.6) Nearside seat belt anchorage prescribed area is excessively corroded (5.2.6) 16 July 2015 [16:15] 16/07/2015 10 July 2012 [17:05] 10/07/2012 398687995169 398687995169 327922592177 327922592177
1 Offside rear service brake effort inadequate at a wheel (1.2.1 (a) (i)) Offside rear service brake effort inadequate at a wheel (1.2.1 (a) (i)) 26 September 2018 [11:45] 26/09/2018 629876566249 629876566249
1 Offside parking brake inoperative on one side (1.4.1 (a)) Offside parking brake inoperative on one side (1.4.1 (a)) 26 September 2018 [11:45] 26/09/2018 629876566249 629876566249
1 Nearside headlamp aim too low (4.1.2 (a)) Nearside headlamp aim too low (4.1.2 (a)) 26 September 2018 [11:45] 26/09/2018 629876566249 629876566249
1 Rear brakes imbalanced across an axle axle 2 (1.2.1 (b) (i)) Rear brakes imbalanced across an axle axle 2 (1.2.1 (b) (i)) 26 September 2018 [11:45] 26/09/2018 629876566249 629876566249
1 Nearside rear subframe mounting prescribed area is excessively corroded (2.4.a.3) Nearside rear subframe mounting prescribed area is excessively corroded (2.4.a.3) 16 July 2015 [16:15] 16/07/2015 398687995169 398687995169
1 Windscreen washer provides insufficient washer liquid (8.2.3) Windscreen washer provides insufficient washer liquid (8.2.3) 10 July 2012 [17:05] 10/07/2012 327922592177 327922592177
1 Vehicle structure excessively corroded within 30cm of towbar mounting (6.6.6) Vehicle structure excessively corroded within 30cm of towbar mounting (6.6.6) 10 July 2012 [17:05] 10/07/2012 327922592177 327922592177
1 Nearside front track rod end ball joint has excessive play (2.2.b.1f) Nearside front track rod end ball joint has excessive play (2.2.b.1f) 10 July 2012 [17:05] 10/07/2012 327922592177 327922592177
1 Offside front track rod end ball joint dust cover excessively damaged so that it no longer prevents the ingress of dirt (2.2.c.1c) Offside front track rod end ball joint dust cover excessively damaged so that it no longer prevents the ingress of dirt (2.2.c.1c) 10 July 2012 [17:05] 10/07/2012 327922592177 327922592177
1 Rear exhaust has a major leak of exhaust gases (7.1.2) Rear exhaust has a major leak of exhaust gases (7.1.2) 10 July 2012 [17:05] 10/07/2012 327922592177 327922592177
1 Offside front tyre tread depth below requirements of 1.6mm (4.1.e.1) Offside front tyre tread depth below requirements of 1.6mm (4.1.e.1) 10 July 2012 [17:05] 10/07/2012 327922592177 327922592177
1 Nearside rear tyre tread depth below requirements of 1.6mm (4.1.e.1) Nearside rear tyre tread depth below requirements of 1.6mm (4.1.e.1) 10 July 2012 [17:05] 10/07/2012 327922592177 327922592177
1 Nearside front suspension has excessive play in a lower suspension ball joint (2.5.b.1a) Nearside front suspension has excessive play in a lower suspension ball joint (2.5.b.1a) 10 July 2012 [17:05] 10/07/2012 327922592177 327922592177
1 Offside front suspension has excessive play in a lower suspension ball joint (2.5.b.1a) Offside front suspension has excessive play in a lower suspension ball joint (2.5.b.1a) 10 July 2012 [17:05] 10/07/2012 327922592177 327922592177
1 Offside steering rack gaiter split (2.2.d.2d) Offside steering rack gaiter split (2.2.d.2d) 18 July 2011 [16:33] 18/07/2011 239359191471 239359191471
1 Front brake pad(s) less than 1.5 mm thick (3.5.1g) Front brake pad(s) less than 1.5 mm thick (3.5.1g) 18 July 2011 [16:33] 18/07/2011 239359191471 239359191471
1 Nearside rear shock absorber detached (2.7.2b) Nearside rear shock absorber detached (2.7.2b) 18 July 2011 [16:33] 18/07/2011 239359191471 239359191471
1 Offside rear suspension spring mounting prescribed area is excessively corroded (2.4.a.3) Offside rear suspension spring mounting prescribed area is excessively corroded (2.4.a.3) 18 July 2011 [16:33] 18/07/2011 239359191471 239359191471
1 Nearside front direction indicator not working (1.4.a.2c) Nearside front direction indicator not working (1.4.a.2c) 16 July 2008 [12:52] 16/07/2008 632378698181 632378698181
1 Nearside front headlamp aim too high (1.8) Nearside front headlamp aim too high (1.8) 16 July 2008 [12:52] 16/07/2008 632378698181 632378698181
1 Nearside front tyre(s) incorrect because different size tyres are fitted on the same axle. (4.1.a.1a) Nearside front tyre(s) incorrect because different size tyres are fitted on the same axle. (4.1.a.1a) 16 July 2008 [12:52] 16/07/2008 632378698181 632378698181
1 Rear brake application uneven (3.7.b.2) Rear brake application uneven (3.7.b.2) 16 July 2008 [12:52] 16/07/2008 632378698181 632378698181
1 Parking brake: efficiency below requirements (3.7.b.7) Parking brake: efficiency below requirements (3.7.b.7) 16 July 2008 [12:52] 16/07/2008 632378698181 632378698181

MOT TEST: 28 September 2018 11:54:14 PASSED
MOT TEST: 28 September 2018 11:54:14 PASSED

This test (179511126465) was completed on the 28 September 2018 11:54:14 and PASSED the requirements for a valid MOT with 0 comments.

This test (179511126465) was completed on the 28 September 2018 11:54:14 and PASSED the requirements for a valid MOT with 0 comments.

Recorded mileage: 21,819

Recorded mileage: 21,819


MOT TEST: 26 September 2018 11:45:36 FAILED
MOT TEST: 26 September 2018 11:45:36 FAILED

This test (629876566249) was completed on the 26 September 2018 11:45:36 and FAILED the requirements for a valid MOT with 4 comments.

This test (629876566249) was completed on the 26 September 2018 11:45:36 and FAILED the requirements for a valid MOT with 4 comments.

Recorded mileage: 21,816

Recorded mileage: 21,816


FAIL


MOT TEST: 28 July 2017 15:13:18 PASSED
MOT TEST: 28 July 2017 15:13:18 PASSED

This test (663307968758) was completed on the 28 July 2017 15:13:18 and PASSED the requirements for a valid MOT with 0 comments.

This test (663307968758) was completed on the 28 July 2017 15:13:18 and PASSED the requirements for a valid MOT with 0 comments.

Recorded mileage: 121,000

Recorded mileage: 121,000


MOT TEST: 28 July 2016 15:19:35 PASSED
MOT TEST: 28 July 2016 15:19:35 PASSED

This test (754587685627) was completed on the 28 July 2016 15:19:35 and PASSED the requirements for a valid MOT with 3 comments.

This test (754587685627) was completed on the 28 July 2016 15:19:35 and PASSED the requirements for a valid MOT with 3 comments.

Recorded mileage: 120,960

Recorded mileage: 120,960


ADVISORY


MOT TEST: 20 July 2015 14:13:41 PASSED
MOT TEST: 20 July 2015 14:13:41 PASSED

This test (385551105281) was completed on the 20 July 2015 14:13:41 and PASSED the requirements for a valid MOT with 0 comments.

This test (385551105281) was completed on the 20 July 2015 14:13:41 and PASSED the requirements for a valid MOT with 0 comments.

Recorded mileage: 119,417

Recorded mileage: 119,417


MOT TEST: 16 July 2015 16:15:23 FAILED
MOT TEST: 16 July 2015 16:15:23 FAILED

This test (398687995169) was completed on the 16 July 2015 16:15:23 and FAILED the requirements for a valid MOT with 5 comments.

This test (398687995169) was completed on the 16 July 2015 16:15:23 and FAILED the requirements for a valid MOT with 5 comments.

Recorded mileage: 119,417

Recorded mileage: 119,417


FAIL


MOT TEST: 08 July 2014 16:16:15 PASSED
MOT TEST: 08 July 2014 16:16:15 PASSED

This test (597239084135) was completed on the 08 July 2014 16:16:15 and PASSED the requirements for a valid MOT with 0 comments.

This test (597239084135) was completed on the 08 July 2014 16:16:15 and PASSED the requirements for a valid MOT with 0 comments.

Recorded mileage: 116,069

Recorded mileage: 116,069


MOT TEST: 12 July 2013 12:40:44 PASSED
MOT TEST: 12 July 2013 12:40:44 PASSED

This test (589363093149) was completed on the 12 July 2013 12:40:44 and PASSED the requirements for a valid MOT with 0 comments.

This test (589363093149) was completed on the 12 July 2013 12:40:44 and PASSED the requirements for a valid MOT with 0 comments.

Recorded mileage: 114,841

Recorded mileage: 114,841


MOT TEST: 30 July 2012 16:06:32 PASSED
MOT TEST: 30 July 2012 16:06:32 PASSED

This test (719002812211) was completed on the 30 July 2012 16:06:32 and PASSED the requirements for a valid MOT with 0 comments.

This test (719002812211) was completed on the 30 July 2012 16:06:32 and PASSED the requirements for a valid MOT with 0 comments.

Recorded mileage: 111,017

Recorded mileage: 111,017


MOT TEST: 10 July 2012 17:05:53 FAILED
MOT TEST: 10 July 2012 17:05:53 FAILED

This test (327922592177) was completed on the 10 July 2012 17:05:53 and FAILED the requirements for a valid MOT with 11 comments.

This test (327922592177) was completed on the 10 July 2012 17:05:53 and FAILED the requirements for a valid MOT with 11 comments.

Recorded mileage: 110,969

Recorded mileage: 110,969


FAIL


MOT TEST: 20 July 2011 07:59:17 PASSED
MOT TEST: 20 July 2011 07:59:17 PASSED

This test (928181001204) was completed on the 20 July 2011 07:59:17 and PASSED the requirements for a valid MOT with 0 comments.

This test (928181001204) was completed on the 20 July 2011 07:59:17 and PASSED the requirements for a valid MOT with 0 comments.

Recorded mileage: 106,147

Recorded mileage: 106,147


MOT TEST: 18 July 2011 16:33:09 FAILED
MOT TEST: 18 July 2011 16:33:09 FAILED

This test (239359191471) was completed on the 18 July 2011 16:33:09 and FAILED the requirements for a valid MOT with 7 comments.

This test (239359191471) was completed on the 18 July 2011 16:33:09 and FAILED the requirements for a valid MOT with 7 comments.

Recorded mileage: 106,106

Recorded mileage: 106,106


ADVISORY

FAIL


MOT TEST: 28 July 2010 16:24:42 PASSED
MOT TEST: 28 July 2010 16:24:42 PASSED

This test (134819100270) was completed on the 28 July 2010 16:24:42 and PASSED the requirements for a valid MOT with 0 comments.

This test (134819100270) was completed on the 28 July 2010 16:24:42 and PASSED the requirements for a valid MOT with 0 comments.

Recorded mileage: 101,666

Recorded mileage: 101,666


MOT TEST: 16 July 2009 09:53:35 PASSED
MOT TEST: 16 July 2009 09:53:35 PASSED

This test (660487499171) was completed on the 16 July 2009 09:53:35 and PASSED the requirements for a valid MOT with 0 comments.

This test (660487499171) was completed on the 16 July 2009 09:53:35 and PASSED the requirements for a valid MOT with 0 comments.

Recorded mileage: 95,480

Recorded mileage: 95,480


MOT TEST: 21 July 2008 07:43:12 PASSED
MOT TEST: 21 July 2008 07:43:12 PASSED

This test (131273808229) was completed on the 21 July 2008 07:43:12 and PASSED the requirements for a valid MOT with 0 comments.

This test (131273808229) was completed on the 21 July 2008 07:43:12 and PASSED the requirements for a valid MOT with 0 comments.

Recorded mileage: 91,907

Recorded mileage: 91,907


MOT TEST: 16 July 2008 12:52:29 FAILED
MOT TEST: 16 July 2008 12:52:29 FAILED

This test (632378698181) was completed on the 16 July 2008 12:52:29 and FAILED the requirements for a valid MOT with 5 comments.

This test (632378698181) was completed on the 16 July 2008 12:52:29 and FAILED the requirements for a valid MOT with 5 comments.

Recorded mileage: 91,758

Recorded mileage: 91,758


FAIL


MOT TEST: 03 July 2007 08:46:24 PASSED
MOT TEST: 03 July 2007 08:46:24 PASSED

This test (211704187148) was completed on the 03 July 2007 08:46:24 and PASSED the requirements for a valid MOT with 4 comments.

This test (211704187148) was completed on the 03 July 2007 08:46:24 and PASSED the requirements for a valid MOT with 4 comments.

Recorded mileage: 86,258

Recorded mileage: 86,258


ADVISORY


MOT TEST: 28 June 2006 15:06:31 PASSED
MOT TEST: 28 June 2006 15:06:31 PASSED

This test (750169676104) was completed on the 28 June 2006 15:06:31 and PASSED the requirements for a valid MOT with 0 comments.

This test (750169676104) was completed on the 28 June 2006 15:06:31 and PASSED the requirements for a valid MOT with 0 comments.

Recorded mileage: 78,609

Recorded mileage: 78,609