AAS 310


AAS310 is registered to a Grey 1961, Morris Minor 1000 with a Petrol engine. It Failed its most recent MOT Test on the 20 June 2016

17 unique faults (20 Total) reported in its MOT History (9 Tests).

1 common/recurring faults.

78% (7) MOT Pass Rate and a 22% (2) MOT Failure Rate.

84,284 recorded miles.

AAS 310


AAS310 is registered to a Grey 1961, Morris Minor 1000 with a Petrol engine. It Failed its most recent MOT Test on the 20 June 2016

17 unique faults (20 Total) reported in its MOT History (9 Tests).

1 common/recurring faults.

78% (7) MOT Pass Rate and a 22% (2) MOT Failure Rate.

84,284 recorded miles.

MOT PASS/Failure rate for AAS 310

all MOT test results for AAS 310 represented as a percentage
MOT PASS/Failure rate for AAS 310
all MOT test results for AAS 310 represented as a percentage

PERCENTAGE OF VEHICLE FAULTS WITH AAS 310

ALL REPORTED FAULTS, DISPLAYED BY PERCENTAGE OF OCCURRENCE DURING ALL MOT TESTS
PERCENTAGE OF VEHICLE FAULTS WITH AAS 310
ALL REPORTED FAULTS, DISPLAYED BY PERCENTAGE OF OCCURRENCE DURING ALL MOT TESTS
ADVISORY

FAIL

AAS 310 annual Faults by type

ALL REPORTED FAULTS, DISPLAYED over time and categorised by type
AAS 310 annual Faults by type
ALL REPORTED FAULTS, DISPLAYED over time and categorised by type

ALL AAS 310 ADVISORIES [6]

ALL ADVISORIES, ORDERED by OCCURRENCE DURING AAS 310's MOT HISTORY
ALL AAS 310 ADVISORIES [6]
ALL ADVISORIES, ORDERED by OCCURRENCE DURING AAS 310's MOT HISTORY
Advisory Faults | source www.vehiclestats.co.uk
Fault Fault Test Date Test Date/Time Reference MOT Test Reference
2 Front suspension spring mounting prescribed area is corroded but not considered excessive (2.4.a.3) Front suspension spring mounting prescribed area is corroded but not considered excessive (2.4.a.3) 11 August 2009 [17:06] 11/08/2009 28 July 2009 [10:50] 28/07/2009 382503829213 382503829213 373139809225 373139809225
1 Body has slight corrosion (6.1.b.2) Body has slight corrosion (6.1.b.2) 20 June 2016 [09:24] 20/06/2016 989561615088 989561615088
1 Body has slight corrosion underside vehicle (6.1.b.2) Body has slight corrosion underside vehicle (6.1.b.2) 20 June 2016 [09:24] 20/06/2016 989561615088 989561615088
1 Offside rear suspension spring mounting prescribed area is corroded but not considered excessive (2.4.a.3) Offside rear suspension spring mounting prescribed area is corroded but not considered excessive (2.4.a.3) 19 June 2007 [10:25] 19/06/2007 611530477132 611530477132
1 Offside rear suspension component mounting prescribed area is corroded but not considered excessive (2.4.a.3) Offside rear suspension component mounting prescribed area is corroded but not considered excessive (2.4.a.3) 19 June 2007 [10:25] 19/06/2007 611530477132 611530477132

ALL AAS 310 Failure Faults [14]

ALL Failure faults, ORDERED by OCCURRENCE DURING AAS 310's MOT HISTORY
ALL AAS 310 Failure Faults [14]
ALL Failure faults, ORDERED by OCCURRENCE DURING AAS 310's MOT HISTORY
Fail Faults | source www.vehiclestats.co.uk
Fault Fault Test Date Test Date/Time Reference MOT Test Reference
1 Nearside front front suspension has excessive movement at a tie bar joint (2.5.a.1c) Nearside front front suspension has excessive movement at a tie bar joint (2.5.a.1c) 28 July 2009 [10:50] 28/07/2009 373139809225 373139809225
1 Offside inner rear suspension spring mounting prescribed area is excessively corroded (2.4.a.3) Offside inner rear suspension spring mounting prescribed area is excessively corroded (2.4.a.3) 28 July 2009 [10:50] 28/07/2009 373139809225 373139809225
1 Nearside rear suspension spring mounting prescribed area is excessively corroded (2.4.a.3) Nearside rear suspension spring mounting prescribed area is excessively corroded (2.4.a.3) 28 July 2009 [10:50] 28/07/2009 373139809225 373139809225
1 Offside front body or chassis has excessive corrosion, seriously affecting its strength within 30cm of the body mountings (6.1.b.2) Offside front body or chassis has excessive corrosion, seriously affecting its strength within 30cm of the body mountings (6.1.b.2) 28 July 2009 [10:50] 28/07/2009 373139809225 373139809225
1 Nearside outer rear suspension spring mounting prescribed area is excessively corroded (2.4.a.3) Nearside outer rear suspension spring mounting prescribed area is excessively corroded (2.4.a.3) 28 July 2009 [10:50] 28/07/2009 373139809225 373139809225
1 Nearside front body or chassis has excessive corrosion, seriously affecting its strength within 30cm of the body mountings (6.1.b.2) Nearside front body or chassis has excessive corrosion, seriously affecting its strength within 30cm of the body mountings (6.1.b.2) 28 July 2009 [10:50] 28/07/2009 373139809225 373139809225
1 Nearside front position lamp(s) not working (1.1.a.3b) Nearside front position lamp(s) not working (1.1.a.3b) 14 July 2008 [14:30] 14/07/2008 753407598154 753407598154
1 Nearside headlamp not working on main beam (1.7.5a) Nearside headlamp not working on main beam (1.7.5a) 14 July 2008 [14:30] 14/07/2008 753407598154 753407598154
1 Nearside front suspension component mounting prescribed area is excessively corroded (2.4.a.3) Nearside front suspension component mounting prescribed area is excessively corroded (2.4.a.3) 14 July 2008 [14:30] 14/07/2008 753407598154 753407598154
1 Offside front suspension component mounting prescribed area is excessively corroded (2.4.a.3) Offside front suspension component mounting prescribed area is excessively corroded (2.4.a.3) 14 July 2008 [14:30] 14/07/2008 753407598154 753407598154
1 Nearside rear suspension component mounting prescribed area is excessively corroded (2.4.a.3) Nearside rear suspension component mounting prescribed area is excessively corroded (2.4.a.3) 14 July 2008 [14:30] 14/07/2008 753407598154 753407598154
1 Offside rear suspension component mounting prescribed area is excessively corroded (2.4.a.3) Offside rear suspension component mounting prescribed area is excessively corroded (2.4.a.3) 14 July 2008 [14:30] 14/07/2008 753407598154 753407598154

MOT TEST: 20 June 2016 09:24:05 PASSED
MOT TEST: 20 June 2016 09:24:05 PASSED

This test (989561615088) was completed on the 20 June 2016 09:24:05 and PASSED the requirements for a valid MOT with 2 comments.

This test (989561615088) was completed on the 20 June 2016 09:24:05 and PASSED the requirements for a valid MOT with 2 comments.

Recorded mileage: 84,284

Recorded mileage: 84,284


ADVISORY


MOT TEST: 16 June 2015 09:25:55 PASSED
MOT TEST: 16 June 2015 09:25:55 PASSED

This test (585977165144) was completed on the 16 June 2015 09:25:55 and PASSED the requirements for a valid MOT with 0 comments.

This test (585977165144) was completed on the 16 June 2015 09:25:55 and PASSED the requirements for a valid MOT with 0 comments.

Recorded mileage: 84,222

Recorded mileage: 84,222


MOT TEST: 28 March 2014 11:13:54 PASSED
MOT TEST: 28 March 2014 11:13:54 PASSED

This test (506577484071) was completed on the 28 March 2014 11:13:54 and PASSED the requirements for a valid MOT with 0 comments.

This test (506577484071) was completed on the 28 March 2014 11:13:54 and PASSED the requirements for a valid MOT with 0 comments.

Recorded mileage: 84,060

Recorded mileage: 84,060


MOT TEST: 21 January 2013 16:04:27 PASSED
MOT TEST: 21 January 2013 16:04:27 PASSED

This test (589921623096) was completed on the 21 January 2013 16:04:27 and PASSED the requirements for a valid MOT with 0 comments.

This test (589921623096) was completed on the 21 January 2013 16:04:27 and PASSED the requirements for a valid MOT with 0 comments.

Recorded mileage: 83,909

Recorded mileage: 83,909


MOT TEST: 11 August 2009 17:06:15 PASSED
MOT TEST: 11 August 2009 17:06:15 PASSED

This test (382503829213) was completed on the 11 August 2009 17:06:15 and PASSED the requirements for a valid MOT with 1 comments.

This test (382503829213) was completed on the 11 August 2009 17:06:15 and PASSED the requirements for a valid MOT with 1 comments.

Recorded mileage: 83,884

Recorded mileage: 83,884


ADVISORY


MOT TEST: 28 July 2009 10:50:33 FAILED
MOT TEST: 28 July 2009 10:50:33 FAILED

This test (373139809225) was completed on the 28 July 2009 10:50:33 and FAILED the requirements for a valid MOT with 8 comments.

This test (373139809225) was completed on the 28 July 2009 10:50:33 and FAILED the requirements for a valid MOT with 8 comments.

Recorded mileage: 83,879

Recorded mileage: 83,879


ADVISORY

FAIL


MOT TEST: 18 July 2008 14:48:06 PASSED
MOT TEST: 18 July 2008 14:48:06 PASSED

This test (861350708299) was completed on the 18 July 2008 14:48:06 and PASSED the requirements for a valid MOT with 0 comments.

This test (861350708299) was completed on the 18 July 2008 14:48:06 and PASSED the requirements for a valid MOT with 0 comments.

Recorded mileage: 83,751

Recorded mileage: 83,751


MOT TEST: 14 July 2008 14:30:00 FAILED
MOT TEST: 14 July 2008 14:30:00 FAILED

This test (753407598154) was completed on the 14 July 2008 14:30:00 and FAILED the requirements for a valid MOT with 7 comments.

This test (753407598154) was completed on the 14 July 2008 14:30:00 and FAILED the requirements for a valid MOT with 7 comments.

Recorded mileage: 83,750

Recorded mileage: 83,750


FAIL


MOT TEST: 19 June 2007 10:25:51 PASSED
MOT TEST: 19 June 2007 10:25:51 PASSED

This test (611530477132) was completed on the 19 June 2007 10:25:51 and PASSED the requirements for a valid MOT with 2 comments.

This test (611530477132) was completed on the 19 June 2007 10:25:51 and PASSED the requirements for a valid MOT with 2 comments.

Recorded mileage: 83,522

Recorded mileage: 83,522


ADVISORY