AAS 322


AAS322 is registered to a Black 1938, Morris with a Petrol engine. It Failed its most recent MOT Test on the 29 May 2012

28 unique faults (30 Total) reported in its MOT History (11 Tests).

2 common/recurring faults, the most frequent (2 times) is: Nearside Stop lamp not working (1.2.1b).

55% (6) MOT Pass Rate and a 45% (5) MOT Failure Rate.

96,268 recorded miles.

AAS 322


AAS322 is registered to a Black 1938, Morris with a Petrol engine. It Failed its most recent MOT Test on the 29 May 2012

28 unique faults (30 Total) reported in its MOT History (11 Tests).

2 common/recurring faults, the most frequent (2 times) is: Nearside Stop lamp not working (1.2.1b).

55% (6) MOT Pass Rate and a 45% (5) MOT Failure Rate.

96,268 recorded miles.

MOT PASS/Failure rate for AAS 322

all MOT test results for AAS 322 represented as a percentage
MOT PASS/Failure rate for AAS 322
all MOT test results for AAS 322 represented as a percentage

PERCENTAGE OF VEHICLE FAULTS WITH AAS 322

ALL REPORTED FAULTS, DISPLAYED BY PERCENTAGE OF OCCURRENCE DURING ALL MOT TESTS
PERCENTAGE OF VEHICLE FAULTS WITH AAS 322
ALL REPORTED FAULTS, DISPLAYED BY PERCENTAGE OF OCCURRENCE DURING ALL MOT TESTS
FAIL

USER ENTERED

PASS WITH RECTIFICATION

AAS 322 annual Faults by type

ALL REPORTED FAULTS, DISPLAYED over time and categorised by type
AAS 322 annual Faults by type
ALL REPORTED FAULTS, DISPLAYED over time and categorised by type

RECURRING FAULTS WITH AAS 322

FAULTS THAT HAVE OCCURED MORE THAN ONCE DURING AAS 322's MOT HISTORY
RECURRING FAULTS WITH AAS 322
FAULTS THAT HAVE OCCURED MORE THAN ONCE DURING AAS 322's MOT HISTORY
Fault Fault Test Date Test Date/Time Reference MOT Test Reference
2 Nearside stop lamp not working (1.2.1b) Nearside stop lamp not working (1.2.1b) 04 May 2010 [09:05] 04/05/2010 26 March 2009 [15:17] 26/03/2009 410394520185 410394520185 334915589061 334915589061
2 Offside rear stop lamp not working (1.2.1b) Offside rear stop lamp not working (1.2.1b) 20 June 2007 [12:52] 20/06/2007 29 March 2006 [14:27] 29/03/2006 161501777177 161501777177 742398686085 742398686085

ALL AAS 322 Failure Faults [14]

ALL Failure faults, ORDERED by OCCURRENCE DURING AAS 322's MOT HISTORY
ALL AAS 322 Failure Faults [14]
ALL Failure faults, ORDERED by OCCURRENCE DURING AAS 322's MOT HISTORY
Fail Faults | source www.vehiclestats.co.uk
Fault Fault Test Date Test Date/Time Reference MOT Test Reference
2 Offside rear stop lamp not working (1.2.1b) Offside rear stop lamp not working (1.2.1b) 20 June 2007 [12:52] 20/06/2007 29 March 2006 [14:27] 29/03/2006 161501777177 161501777177 742398686085 742398686085
1 Offside headlamp not working on dipped beam (1.7.5a) Offside headlamp not working on dipped beam (1.7.5a) 26 March 2009 [15:17] 26/03/2009 334915589061 334915589061
1 Nearside stop lamp not working (1.2.1b) Nearside stop lamp not working (1.2.1b) 26 March 2009 [15:17] 26/03/2009 334915589061 334915589061
1 Offside front brake hose excessively deteriorated (3.6.b.4d) Offside front brake hose excessively deteriorated (3.6.b.4d) 26 March 2009 [15:17] 26/03/2009 334915589061 334915589061
1 Nearside rear suspension spring mounting prescribed area is inadequately repaired (2.4.a.3) Nearside rear suspension spring mounting prescribed area is inadequately repaired (2.4.a.3) 26 March 2009 [15:17] 26/03/2009 334915589061 334915589061
1 Offside rear suspension spring mounting prescribed area is inadequately repaired (2.4.a.3) Offside rear suspension spring mounting prescribed area is inadequately repaired (2.4.a.3) 26 March 2009 [15:17] 26/03/2009 334915589061 334915589061
1 Nearside rear brake recording little or no effort (3.7.b.5a) Nearside rear brake recording little or no effort (3.7.b.5a) 26 March 2009 [15:17] 26/03/2009 334915589061 334915589061
1 Offside rear wheel bearing has excessive play (2.6.2) Offside rear wheel bearing has excessive play (2.6.2) 20 June 2007 [12:52] 20/06/2007 161501777177 161501777177
1 Nearside rear suspension component mounting prescribed area is excessively corroded (2.4.a.3) Nearside rear suspension component mounting prescribed area is excessively corroded (2.4.a.3) 20 June 2007 [12:52] 20/06/2007 161501777177 161501777177
1 Offside rear suspension component mounting prescribed area is excessively corroded (2.4.a.3) Offside rear suspension component mounting prescribed area is excessively corroded (2.4.a.3) 20 June 2007 [12:52] 20/06/2007 161501777177 161501777177
1 Nearside rear direction indicator not working (1.4.a.2c) Nearside rear direction indicator not working (1.4.a.2c) 29 March 2006 [14:27] 29/03/2006 742398686085 742398686085
1 Offside front ball joint has excessive play (2.2.b.1f) Offside front ball joint has excessive play (2.2.b.1f) 29 March 2006 [14:27] 29/03/2006 742398686085 742398686085
1 Exhaust has a major leak of exhaust gases (7.1.2) Exhaust has a major leak of exhaust gases (7.1.2) 29 March 2006 [14:27] 29/03/2006 742398686085 742398686085

ALL AAS 322 User Entered Faults [11]

ALL User Entered faults, ORDERED by OCCURRENCE DURING AAS 322's MOT HISTORY
ALL AAS 322 User Entered Faults [11]
ALL User Entered faults, ORDERED by OCCURRENCE DURING AAS 322's MOT HISTORY
Fail Faults | source www.vehiclestats.co.uk
Fault Fault Test Date Test Date/Time Reference MOT Test Reference
1 General corrosion on chassis /suspension/etc. General corrosion on chassis /suspension/etc. 20 June 2007 [12:52] 20/06/2007 161501777177 161501777177
1 Corrosion on off side front flexible brake pipe ends. Corrosion on off side front flexible brake pipe ends. 20 June 2007 [12:52] 20/06/2007 161501777177 161501777177
1 General play in front suspension ball joints kingpins etc. General play in front suspension ball joints kingpins etc. 20 June 2007 [12:52] 20/06/2007 161501777177 161501777177
1 Slight binding on off side rear brake. Slight binding on off side rear brake. 03 May 2006 [11:00] 03/05/2006 753163526125 753163526125
1 Off side front main beam not working. Off side front main beam not working. 03 May 2006 [11:00] 03/05/2006 753163526125 753163526125
1 Oil leak from engine /gear box area. Oil leak from engine /gear box area. 03 May 2006 [11:00] 03/05/2006 753163526125 753163526125
1 General play from both front king pins /steering system etc. General play from both front king pins /steering system etc. 03 May 2006 [11:00] 03/05/2006 753163526125 753163526125
1 General play from front suspension system General play from front suspension system 29 March 2006 [14:27] 29/03/2006 742398686085 742398686085
1 Off side front main beam not working Off side front main beam not working 29 March 2006 [14:27] 29/03/2006 742398686085 742398686085
1 Off side rear brake binding on slightly Off side rear brake binding on slightly 29 March 2006 [14:27] 29/03/2006 742398686085 742398686085
1 Excessive corrosion off side front chassis not in a prescribed area(near clutch slave cylinder) Excessive corrosion off side front chassis not in a prescribed area(near clutch slave cylinder) 29 March 2006 [14:27] 29/03/2006 742398686085 742398686085

ALL AAS 322 Pass With Rectification Faults [5]

ALL Pass With Rectification faults, ORDERED by OCCURRENCE DURING AAS 322's MOT HISTORY
ALL AAS 322 Pass With Rectification Faults [5]
ALL Pass With Rectification faults, ORDERED by OCCURRENCE DURING AAS 322's MOT HISTORY
Pass With Rectification Faults | source www.vehiclestats.co.uk
Fault Fault Test Date Test Date/Time Reference MOT Test Reference
1 Nearside headlamp aim too low (1.8) Nearside headlamp aim too low (1.8) 18 May 2011 [18:07] 18/05/2011 229158831445 229158831445
1 Offside headlamp aim too high (1.8) Offside headlamp aim too high (1.8) 18 May 2011 [18:07] 18/05/2011 229158831445 229158831445
1 Service brake is causing the steering wheel to severely pull one way (3.7.c.2) Service brake is causing the steering wheel to severely pull one way (3.7.c.2) 18 May 2011 [18:07] 18/05/2011 229158831445 229158831445
1 Nearside stop lamp not working (1.2.1b) Nearside stop lamp not working (1.2.1b) 04 May 2010 [09:05] 04/05/2010 410394520185 410394520185
1 Offside stop lamp not working (1.2.1b) Offside stop lamp not working (1.2.1b) 04 May 2010 [09:05] 04/05/2010 410394520185 410394520185

MOT TEST: 29 May 2012 09:45:55 PASSED
MOT TEST: 29 May 2012 09:45:55 PASSED

This test (705760652136) was completed on the 29 May 2012 09:45:55 and PASSED the requirements for a valid MOT with 0 comments.

This test (705760652136) was completed on the 29 May 2012 09:45:55 and PASSED the requirements for a valid MOT with 0 comments.

Recorded mileage: 96,268

Recorded mileage: 96,268


MOT TEST: 18 May 2011 18:07:57 PASSED
MOT TEST: 18 May 2011 18:07:57 PASSED

This test (437118531120) was completed on the 18 May 2011 18:07:57 and PASSED the requirements for a valid MOT with 0 comments.

This test (437118531120) was completed on the 18 May 2011 18:07:57 and PASSED the requirements for a valid MOT with 0 comments.

Recorded mileage: 96,260

Recorded mileage: 96,260


MOT TEST: 18 May 2011 18:07:57 FAILED
MOT TEST: 18 May 2011 18:07:57 FAILED

This test (229158831445) was completed on the 18 May 2011 18:07:57 and FAILED the requirements for a valid MOT with 3 comments.

This test (229158831445) was completed on the 18 May 2011 18:07:57 and FAILED the requirements for a valid MOT with 3 comments.

Recorded mileage: 96,260

Recorded mileage: 96,260


PASS WITH RECTIFICATION


MOT TEST: 04 May 2010 09:05:40 FAILED
MOT TEST: 04 May 2010 09:05:40 FAILED

This test (410394520185) was completed on the 04 May 2010 09:05:40 and FAILED the requirements for a valid MOT with 2 comments.

This test (410394520185) was completed on the 04 May 2010 09:05:40 and FAILED the requirements for a valid MOT with 2 comments.

Recorded mileage: 96,260

Recorded mileage: 96,260


PASS WITH RECTIFICATION


MOT TEST: 04 May 2010 09:05:40 PASSED
MOT TEST: 04 May 2010 09:05:40 PASSED

This test (111604320198) was completed on the 04 May 2010 09:05:40 and PASSED the requirements for a valid MOT with 0 comments.

This test (111604320198) was completed on the 04 May 2010 09:05:40 and PASSED the requirements for a valid MOT with 0 comments.

Recorded mileage: 96,260

Recorded mileage: 96,260


MOT TEST: 08 April 2009 17:05:19 PASSED
MOT TEST: 08 April 2009 17:05:19 PASSED

This test (574448999052) was completed on the 08 April 2009 17:05:19 and PASSED the requirements for a valid MOT with 0 comments.

This test (574448999052) was completed on the 08 April 2009 17:05:19 and PASSED the requirements for a valid MOT with 0 comments.

Recorded mileage: 96,260

Recorded mileage: 96,260


MOT TEST: 26 March 2009 15:17:42 FAILED
MOT TEST: 26 March 2009 15:17:42 FAILED

This test (334915589061) was completed on the 26 March 2009 15:17:42 and FAILED the requirements for a valid MOT with 6 comments.

This test (334915589061) was completed on the 26 March 2009 15:17:42 and FAILED the requirements for a valid MOT with 6 comments.

Recorded mileage: 96,260

Recorded mileage: 96,260


FAIL


MOT TEST: 27 June 2007 10:21:11 PASSED
MOT TEST: 27 June 2007 10:21:11 PASSED

This test (242358977472) was completed on the 27 June 2007 10:21:11 and PASSED the requirements for a valid MOT with 0 comments.

This test (242358977472) was completed on the 27 June 2007 10:21:11 and PASSED the requirements for a valid MOT with 0 comments.

Recorded mileage: 96,243

Recorded mileage: 96,243


MOT TEST: 20 June 2007 12:52:53 FAILED
MOT TEST: 20 June 2007 12:52:53 FAILED

This test (161501777177) was completed on the 20 June 2007 12:52:53 and FAILED the requirements for a valid MOT with 7 comments.

This test (161501777177) was completed on the 20 June 2007 12:52:53 and FAILED the requirements for a valid MOT with 7 comments.

Recorded mileage: 96,231

Recorded mileage: 96,231


FAIL

USER ENTERED


MOT TEST: 03 May 2006 11:00:37 PASSED
MOT TEST: 03 May 2006 11:00:37 PASSED

This test (753163526125) was completed on the 03 May 2006 11:00:37 and PASSED the requirements for a valid MOT with 4 comments.

This test (753163526125) was completed on the 03 May 2006 11:00:37 and PASSED the requirements for a valid MOT with 4 comments.

Recorded mileage: 96,177

Recorded mileage: 96,177


USER ENTERED


MOT TEST: 29 March 2006 14:27:40 FAILED
MOT TEST: 29 March 2006 14:27:40 FAILED

This test (742398686085) was completed on the 29 March 2006 14:27:40 and FAILED the requirements for a valid MOT with 8 comments.

This test (742398686085) was completed on the 29 March 2006 14:27:40 and FAILED the requirements for a valid MOT with 8 comments.

Recorded mileage: 96,177

Recorded mileage: 96,177


FAIL

USER ENTERED