AAS 338


AAS338 is registered to a Black 1971, Morris Minor with a Petrol engine. It Failed its most recent MOT Test on the 22 April 2006

10 unique faults (11 Total) reported in its MOT History (2 Tests).

0 common/recurring faults.

50% (1) MOT Pass Rate and a 50% (1) MOT Failure Rate.

82,727 recorded miles.

AAS 338


AAS338 is registered to a Black 1971, Morris Minor with a Petrol engine. It Failed its most recent MOT Test on the 22 April 2006

10 unique faults (11 Total) reported in its MOT History (2 Tests).

0 common/recurring faults.

50% (1) MOT Pass Rate and a 50% (1) MOT Failure Rate.

82,727 recorded miles.

MOT PASS/Failure rate for AAS 338

all MOT test results for AAS 338 represented as a percentage
MOT PASS/Failure rate for AAS 338
all MOT test results for AAS 338 represented as a percentage

PERCENTAGE OF VEHICLE FAULTS WITH AAS 338

ALL REPORTED FAULTS, DISPLAYED BY PERCENTAGE OF OCCURRENCE DURING ALL MOT TESTS
PERCENTAGE OF VEHICLE FAULTS WITH AAS 338
ALL REPORTED FAULTS, DISPLAYED BY PERCENTAGE OF OCCURRENCE DURING ALL MOT TESTS
FAIL

AAS 338 annual Faults by type

ALL REPORTED FAULTS, DISPLAYED over time and categorised by type
AAS 338 annual Faults by type
ALL REPORTED FAULTS, DISPLAYED over time and categorised by type

ALL AAS 338 Failure Faults [11]

ALL Failure faults, ORDERED by OCCURRENCE DURING AAS 338's MOT HISTORY
ALL AAS 338 Failure Faults [11]
ALL Failure faults, ORDERED by OCCURRENCE DURING AAS 338's MOT HISTORY
Fail Faults | source www.vehiclestats.co.uk
Fault Fault Test Date Test Date/Time Reference MOT Test Reference
1 Drivers seat insecure (6.2.a.1) Drivers seat insecure (6.2.a.1) 11 April 2006 [12:27] 11/04/2006 821171206109 821171206109
1 Nearside front position lamp(s) not working (1.1.a.3b) Nearside front position lamp(s) not working (1.1.a.3b) 11 April 2006 [12:27] 11/04/2006 821171206109 821171206109
1 Offside front position lamp(s) not working (1.1.a.3b) Offside front position lamp(s) not working (1.1.a.3b) 11 April 2006 [12:27] 11/04/2006 821171206109 821171206109
1 Nearside headlamp not working on dipped beam (1.7.5a) Nearside headlamp not working on dipped beam (1.7.5a) 11 April 2006 [12:27] 11/04/2006 821171206109 821171206109
1 Registration plate lamp not working (1.1.c.1d) Registration plate lamp not working (1.1.c.1d) 11 April 2006 [12:27] 11/04/2006 821171206109 821171206109
1 Nearside rear position lamp(s) excessively deteriorated so that it is not visible from a reasonable distance (1.1.a.3d) Nearside rear position lamp(s) excessively deteriorated so that it is not visible from a reasonable distance (1.1.a.3d) 11 April 2006 [12:27] 11/04/2006 821171206109 821171206109
1 Nearside front brake pipe excessively corroded (3.6.b.2c) Nearside front brake pipe excessively corroded (3.6.b.2c) 11 April 2006 [12:27] 11/04/2006 821171206109 821171206109
1 Body or chassis has excessive corrosion, seriously affecting its strength within 30cm of the body mountings (6.1.b.2) Body or chassis has excessive corrosion, seriously affecting its strength within 30cm of the body mountings (6.1.b.2) 11 April 2006 [12:27] 11/04/2006 821171206109 821171206109
1 Offside rear rear brake recording little or no effort (3.7.b.5a) Offside rear rear brake recording little or no effort (3.7.b.5a) 11 April 2006 [12:27] 11/04/2006 821171206109 821171206109
1 Offside rear parking brake recording little or no effort (3.7.b.6a) Offside rear parking brake recording little or no effort (3.7.b.6a) 11 April 2006 [12:27] 11/04/2006 821171206109 821171206109

MOT TEST: 22 April 2006 12:37:14 PASSED
MOT TEST: 22 April 2006 12:37:14 PASSED

This test (792012016196) was completed on the 22 April 2006 12:37:14 and PASSED the requirements for a valid MOT with 0 comments.

This test (792012016196) was completed on the 22 April 2006 12:37:14 and PASSED the requirements for a valid MOT with 0 comments.

Recorded mileage: 82,727

Recorded mileage: 82,727


MOT TEST: 11 April 2006 12:27:04 FAILED
MOT TEST: 11 April 2006 12:27:04 FAILED

This test (821171206109) was completed on the 11 April 2006 12:27:04 and FAILED the requirements for a valid MOT with 11 comments.

This test (821171206109) was completed on the 11 April 2006 12:27:04 and FAILED the requirements for a valid MOT with 11 comments.

Recorded mileage: 82,727

Recorded mileage: 82,727


FAIL