AOD 790A


AOD790A is registered to a Maroon 1963, Morris Minor with a Petrol engine. It Passed its most recent MOT Test on the 16 May 2018

13 unique faults (19 Total) reported in its MOT History (9 Tests).

4 common/recurring faults, the most frequent (4 times) is: Steering column top bearing slightly worn (2.1.2c).

78% (7) MOT Pass Rate and a 22% (2) MOT Failure Rate.

13,861 recorded miles.

AOD 790A


AOD790A is registered to a Maroon 1963, Morris Minor with a Petrol engine. It Passed its most recent MOT Test on the 16 May 2018

13 unique faults (19 Total) reported in its MOT History (9 Tests).

4 common/recurring faults, the most frequent (4 times) is: Steering column top bearing slightly worn (2.1.2c).

78% (7) MOT Pass Rate and a 22% (2) MOT Failure Rate.

13,861 recorded miles.

MOT PASS/Failure rate for AOD 790A

all MOT test results for AOD 790A represented as a percentage
MOT PASS/Failure rate for AOD 790A
all MOT test results for AOD 790A represented as a percentage

PERCENTAGE OF VEHICLE FAULTS WITH AOD 790A

ALL REPORTED FAULTS, DISPLAYED BY PERCENTAGE OF OCCURRENCE DURING ALL MOT TESTS
PERCENTAGE OF VEHICLE FAULTS WITH AOD 790A
ALL REPORTED FAULTS, DISPLAYED BY PERCENTAGE OF OCCURRENCE DURING ALL MOT TESTS
ADVISORY

FAIL

USER ENTERED

AOD 790A annual Faults by type

ALL REPORTED FAULTS, DISPLAYED over time and categorised by type
AOD 790A annual Faults by type
ALL REPORTED FAULTS, DISPLAYED over time and categorised by type

RECURRING FAULTS WITH AOD 790A

FAULTS THAT HAVE OCCURED MORE THAN ONCE DURING AOD 790A's MOT HISTORY
RECURRING FAULTS WITH AOD 790A
FAULTS THAT HAVE OCCURED MORE THAN ONCE DURING AOD 790A's MOT HISTORY
Fault Fault Test Date Test Date/Time Reference MOT Test Reference
4 Steering column top bearing slightly worn (2.1.2c) Steering column top bearing slightly worn (2.1.2c) 16 May 2018 [15:09] 16/05/2018 03 May 2017 [11:31] 03/05/2017 28 April 2016 [14:42] 28/04/2016 27 April 2016 [13:52] 27/04/2016 348988867438 348988867438 425343933541 425343933541 749882142094 749882142094 553803760304 553803760304
2 Front crossmember /chassis legs getting rusty Front crossmember /chassis legs getting rusty 02 May 2014 [15:55] 02/05/2014 01 May 2014 [10:50] 01/05/2014 498622924190 498622924190 329401024186 329401024186
2 O/s/r spring mount getting rusty O/s/r spring mount getting rusty 02 May 2014 [15:55] 02/05/2014 01 May 2014 [10:50] 01/05/2014 498622924190 498622924190 329401024186 329401024186
2 N/s/f floor getting rusty N/s/f floor getting rusty 02 May 2014 [15:55] 02/05/2014 01 May 2014 [10:50] 01/05/2014 498622924190 498622924190 329401024186 329401024186

ALL AOD 790A ADVISORIES [5]

ALL ADVISORIES, ORDERED by OCCURRENCE DURING AOD 790A's MOT HISTORY
ALL AOD 790A ADVISORIES [5]
ALL ADVISORIES, ORDERED by OCCURRENCE DURING AOD 790A's MOT HISTORY
Advisory Faults | source www.vehiclestats.co.uk
Fault Fault Test Date Test Date/Time Reference MOT Test Reference
4 Steering column top bearing slightly worn (2.1.2c) Steering column top bearing slightly worn (2.1.2c) 16 May 2018 [15:09] 16/05/2018 03 May 2017 [11:31] 03/05/2017 28 April 2016 [14:42] 28/04/2016 27 April 2016 [13:52] 27/04/2016 348988867438 348988867438 425343933541 425343933541 749882142094 749882142094 553803760304 553803760304
1 Nearside front steering rack gaiter deteriorated (2.2.d.2d) Nearside front steering rack gaiter deteriorated (2.2.d.2d) 24 April 2015 [11:17] 24/04/2015 188864915176 188864915176

ALL AOD 790A Failure Faults [6]

ALL Failure faults, ORDERED by OCCURRENCE DURING AOD 790A's MOT HISTORY
ALL AOD 790A Failure Faults [6]
ALL Failure faults, ORDERED by OCCURRENCE DURING AOD 790A's MOT HISTORY
Advisory Faults | source www.vehiclestats.co.uk
Fault Fault Test Date Test Date/Time Reference MOT Test Reference
1 Nearside steering rack gaiter split (2.2.d.2d) Nearside steering rack gaiter split (2.2.d.2d) 27 April 2016 [13:52] 27/04/2016 553803760304 553803760304
1 Exhaust system not adequately supported down pipe (7.1.1) Exhaust system not adequately supported down pipe (7.1.1) 27 April 2016 [13:52] 27/04/2016 553803760304 553803760304
1 Front windscreen washer provides insufficient washer liquid (8.2.3) Front windscreen washer provides insufficient washer liquid (8.2.3) 01 May 2014 [10:50] 01/05/2014 329401024186 329401024186
1 Offside front headlamp aim beam image obviously incorrect (1.8.a.1b) Offside front headlamp aim beam image obviously incorrect (1.8.a.1b) 01 May 2014 [10:50] 01/05/2014 329401024186 329401024186
1 Nearside rear rear parking brake recording little or no effort (3.7.b.6a) Nearside rear rear parking brake recording little or no effort (3.7.b.6a) 01 May 2014 [10:50] 01/05/2014 329401024186 329401024186
1 Parking brake: efficiency below requirements (3.7.b.7) Parking brake: efficiency below requirements (3.7.b.7) 01 May 2014 [10:50] 01/05/2014 329401024186 329401024186

ALL AOD 790A User Entered Faults [8]

ALL User Entered faults, ORDERED by OCCURRENCE DURING AOD 790A's MOT HISTORY
ALL AOD 790A User Entered Faults [8]
ALL User Entered faults, ORDERED by OCCURRENCE DURING AOD 790A's MOT HISTORY
User Entered Faults | source www.vehiclestats.co.uk
Fault Fault Test Date Test Date/Time Reference MOT Test Reference
2 Front crossmember /chassis legs getting rusty Front crossmember /chassis legs getting rusty 02 May 2014 [15:55] 02/05/2014 01 May 2014 [10:50] 01/05/2014 498622924190 498622924190 329401024186 329401024186
2 O/s/r spring mount getting rusty O/s/r spring mount getting rusty 02 May 2014 [15:55] 02/05/2014 01 May 2014 [10:50] 01/05/2014 498622924190 498622924190 329401024186 329401024186
2 N/s/f floor getting rusty N/s/f floor getting rusty 02 May 2014 [15:55] 02/05/2014 01 May 2014 [10:50] 01/05/2014 498622924190 498622924190 329401024186 329401024186
1 Headlamp switch slightly sticky Headlamp switch slightly sticky 19 April 2013 [10:24] 19/04/2013 306769203165 306769203165
1 Slight play in steering column Slight play in steering column 19 April 2013 [10:24] 19/04/2013 306769203165 306769203165

MOT TEST: 16 May 2018 15:09:35 PASSED
MOT TEST: 16 May 2018 15:09:35 PASSED

This test (348988867438) was completed on the 16 May 2018 15:09:35 and PASSED the requirements for a valid MOT with 1 comments.

This test (348988867438) was completed on the 16 May 2018 15:09:35 and PASSED the requirements for a valid MOT with 1 comments.

Recorded mileage: 13,861

Recorded mileage: 13,861


ADVISORY


MOT TEST: 03 May 2017 11:31:07 PASSED
MOT TEST: 03 May 2017 11:31:07 PASSED

This test (425343933541) was completed on the 03 May 2017 11:31:07 and PASSED the requirements for a valid MOT with 1 comments.

This test (425343933541) was completed on the 03 May 2017 11:31:07 and PASSED the requirements for a valid MOT with 1 comments.

Recorded mileage: 13,812

Recorded mileage: 13,812


ADVISORY


MOT TEST: 28 April 2016 14:42:33 PASSED
MOT TEST: 28 April 2016 14:42:33 PASSED

This test (749882142094) was completed on the 28 April 2016 14:42:33 and PASSED the requirements for a valid MOT with 1 comments.

This test (749882142094) was completed on the 28 April 2016 14:42:33 and PASSED the requirements for a valid MOT with 1 comments.

Recorded mileage: 13,730

Recorded mileage: 13,730


ADVISORY


MOT TEST: 27 April 2016 13:52:40 FAILED
MOT TEST: 27 April 2016 13:52:40 FAILED

This test (553803760304) was completed on the 27 April 2016 13:52:40 and FAILED the requirements for a valid MOT with 3 comments.

This test (553803760304) was completed on the 27 April 2016 13:52:40 and FAILED the requirements for a valid MOT with 3 comments.

Recorded mileage: 13,730

Recorded mileage: 13,730


ADVISORY

FAIL


MOT TEST: 24 April 2015 11:17:49 PASSED
MOT TEST: 24 April 2015 11:17:49 PASSED

This test (188864915176) was completed on the 24 April 2015 11:17:49 and PASSED the requirements for a valid MOT with 1 comments.

This test (188864915176) was completed on the 24 April 2015 11:17:49 and PASSED the requirements for a valid MOT with 1 comments.

Recorded mileage: 13,626

Recorded mileage: 13,626


ADVISORY


MOT TEST: 02 May 2014 15:55:17 PASSED
MOT TEST: 02 May 2014 15:55:17 PASSED

This test (498622924190) was completed on the 02 May 2014 15:55:17 and PASSED the requirements for a valid MOT with 3 comments.

This test (498622924190) was completed on the 02 May 2014 15:55:17 and PASSED the requirements for a valid MOT with 3 comments.

Recorded mileage: 13,490

Recorded mileage: 13,490


USER ENTERED


MOT TEST: 01 May 2014 10:50:12 FAILED
MOT TEST: 01 May 2014 10:50:12 FAILED

This test (329401024186) was completed on the 01 May 2014 10:50:12 and FAILED the requirements for a valid MOT with 7 comments.

This test (329401024186) was completed on the 01 May 2014 10:50:12 and FAILED the requirements for a valid MOT with 7 comments.

Recorded mileage: 13,490

Recorded mileage: 13,490


FAIL

USER ENTERED


MOT TEST: 19 April 2013 10:24:00 PASSED
MOT TEST: 19 April 2013 10:24:00 PASSED

This test (306769203165) was completed on the 19 April 2013 10:24:00 and PASSED the requirements for a valid MOT with 2 comments.

This test (306769203165) was completed on the 19 April 2013 10:24:00 and PASSED the requirements for a valid MOT with 2 comments.

Recorded mileage: 13,227

Recorded mileage: 13,227


USER ENTERED


MOT TEST: 03 May 2012 15:01:29 PASSED
MOT TEST: 03 May 2012 15:01:29 PASSED

This test (778794322175) was completed on the 03 May 2012 15:01:29 and PASSED the requirements for a valid MOT with 0 comments.

This test (778794322175) was completed on the 03 May 2012 15:01:29 and PASSED the requirements for a valid MOT with 0 comments.

Recorded mileage: 13,165

Recorded mileage: 13,165