AOW 311A


AOW311A is registered to a Grey 1963, Morris 1100 with a Petrol engine. It Failed its most recent MOT Test on the 25 July 2017

30 unique faults (36 Total) reported in its MOT History (14 Tests).

6 common/recurring faults, the most frequent (2 times) is: Front wheel bearing has slight play both front (2.5.A.3c).

57% (8) MOT Pass Rate and a 43% (6) MOT Failure Rate.

98,995 recorded miles.

AOW 311A


AOW311A is registered to a Grey 1963, Morris 1100 with a Petrol engine. It Failed its most recent MOT Test on the 25 July 2017

30 unique faults (36 Total) reported in its MOT History (14 Tests).

6 common/recurring faults, the most frequent (2 times) is: Front wheel bearing has slight play both front (2.5.A.3c).

57% (8) MOT Pass Rate and a 43% (6) MOT Failure Rate.

98,995 recorded miles.

MOT PASS/Failure rate for AOW 311A

all MOT test results for AOW 311A represented as a percentage
MOT PASS/Failure rate for AOW 311A
all MOT test results for AOW 311A represented as a percentage

PERCENTAGE OF VEHICLE FAULTS WITH AOW 311A

ALL REPORTED FAULTS, DISPLAYED BY PERCENTAGE OF OCCURRENCE DURING ALL MOT TESTS
PERCENTAGE OF VEHICLE FAULTS WITH AOW 311A
ALL REPORTED FAULTS, DISPLAYED BY PERCENTAGE OF OCCURRENCE DURING ALL MOT TESTS
ADVISORY

FAIL

USER ENTERED

PASS WITH RECTIFICATION

AOW 311A annual Faults by type

ALL REPORTED FAULTS, DISPLAYED over time and categorised by type
AOW 311A annual Faults by type
ALL REPORTED FAULTS, DISPLAYED over time and categorised by type

RECURRING FAULTS WITH AOW 311A

FAULTS THAT HAVE OCCURED MORE THAN ONCE DURING AOW 311A's MOT HISTORY
RECURRING FAULTS WITH AOW 311A
FAULTS THAT HAVE OCCURED MORE THAN ONCE DURING AOW 311A's MOT HISTORY
Fault Fault Test Date Test Date/Time Reference MOT Test Reference
2 Front wheel bearing has slight play both front (2.5.a.3c) Front wheel bearing has slight play both front (2.5.a.3c) 13 June 2016 [10:13] 13/06/2016 07 June 2016 [09:35] 07/06/2016 219953958434 219953958434 224313018501 224313018501
2 Front suspension has slight movement at a suspension ball joint both front lower (2.5.a.1c) Front suspension has slight movement at a suspension ball joint both front lower (2.5.a.1c) 13 June 2016 [10:13] 13/06/2016 07 June 2016 [09:35] 07/06/2016 219953958434 219953958434 224313018501 224313018501
2 N/s/f and o/s/f floor corroded N/s/f and o/s/f floor corroded 18 June 2015 [08:47] 18/06/2015 09 June 2015 [11:01] 09/06/2015 708009365152 708009365152 258940165125 258940165125
2 O/s bodywork corroded O/s bodywork corroded 18 June 2015 [08:47] 18/06/2015 09 June 2015 [11:01] 09/06/2015 708009365152 708009365152 258940165125 258940165125
2 Nearside steering rack gaiter split (2.2.d.2d) Nearside steering rack gaiter split (2.2.d.2d) 09 June 2015 [11:01] 09/06/2015 20 May 2011 [10:06] 20/05/2011 258940165125 258940165125 637020941152 637020941152
2 Steering column loose rect Steering column loose rect 14 June 2014 [12:31] 14/06/2014 14 June 2014 [12:31] 14/06/2014 558735964132 558735964132 379195364100 379195364100

ALL AOW 311A ADVISORIES [7]

ALL ADVISORIES, ORDERED by OCCURRENCE DURING AOW 311A's MOT HISTORY
ALL AOW 311A ADVISORIES [7]
ALL ADVISORIES, ORDERED by OCCURRENCE DURING AOW 311A's MOT HISTORY
Advisory Faults | source www.vehiclestats.co.uk
Fault Fault Test Date Test Date/Time Reference MOT Test Reference
2 Front wheel bearing has slight play both front (2.5.a.3c) Front wheel bearing has slight play both front (2.5.a.3c) 13 June 2016 [10:13] 13/06/2016 07 June 2016 [09:35] 07/06/2016 219953958434 219953958434 224313018501 224313018501
2 Front suspension has slight movement at a suspension ball joint both front lower (2.5.a.1c) Front suspension has slight movement at a suspension ball joint both front lower (2.5.a.1c) 13 June 2016 [10:13] 13/06/2016 07 June 2016 [09:35] 07/06/2016 219953958434 219953958434 224313018501 224313018501
1 Under side rusting Under side rusting 25 July 2017 [14:40] 25/07/2017 836195572332 836195572332
1 Offside rear suspension component mounting prescribed area is corroded but not considered excessive door step (2.4.a.3) Offside rear suspension component mounting prescribed area is corroded but not considered excessive door step (2.4.a.3) 07 June 2016 [09:35] 07/06/2016 224313018501 224313018501
1 Nearside front upper front suspension has slight play in a upper suspension ball joint (2.5.b.1a) Nearside front upper front suspension has slight play in a upper suspension ball joint (2.5.b.1a) 15 June 2013 [12:14] 15/06/2013 206236963139 206236963139

ALL AOW 311A Failure Faults [19]

ALL Failure faults, ORDERED by OCCURRENCE DURING AOW 311A's MOT HISTORY
ALL AOW 311A Failure Faults [19]
ALL Failure faults, ORDERED by OCCURRENCE DURING AOW 311A's MOT HISTORY
Fail Faults | source www.vehiclestats.co.uk
Fault Fault Test Date Test Date/Time Reference MOT Test Reference
2 Nearside steering rack gaiter split (2.2.d.2d) Nearside steering rack gaiter split (2.2.d.2d) 09 June 2015 [11:01] 09/06/2015 20 May 2011 [10:06] 20/05/2011 258940165125 258940165125 637020941152 637020941152
1 Windscreen washer provides insufficient washer liquid (8.2.3) Windscreen washer provides insufficient washer liquid (8.2.3) 07 June 2016 [09:35] 07/06/2016 224313018501 224313018501
1 Nearside front suspension component mounting prescribed area is excessively corroded chassis (2.4.a.3) Nearside front suspension component mounting prescribed area is excessively corroded chassis (2.4.a.3) 07 June 2016 [09:35] 07/06/2016 224313018501 224313018501
1 Offside front suspension component mounting prescribed area is excessively corroded outer floor (2.4.a.3) Offside front suspension component mounting prescribed area is excessively corroded outer floor (2.4.a.3) 07 June 2016 [09:35] 07/06/2016 224313018501 224313018501
1 Nearside rear inner suspension component mounting prescribed area is excessively corroded front wing (2.4.a.3) Nearside rear inner suspension component mounting prescribed area is excessively corroded front wing (2.4.a.3) 07 June 2016 [09:35] 07/06/2016 224313018501 224313018501
1 Offside front tyre tread depth below requirements of 1.6mm (4.1.e.1) Offside front tyre tread depth below requirements of 1.6mm (4.1.e.1) 09 June 2015 [11:01] 09/06/2015 258940165125 258940165125
1 Nearside front suspension component mounting prescribed area is excessively corroded (2.4.a.3) Nearside front suspension component mounting prescribed area is excessively corroded (2.4.a.3) 09 June 2015 [11:01] 09/06/2015 258940165125 258940165125
1 Offside rear suspension spring mounting prescribed area is excessively corroded (2.4.a.3) Offside rear suspension spring mounting prescribed area is excessively corroded (2.4.a.3) 09 June 2015 [11:01] 09/06/2015 258940165125 258940165125
1 Front brake binding (3.7.b.1) Front brake binding (3.7.b.1) 09 June 2015 [11:01] 09/06/2015 258940165125 258940165125
1 Nearside front vehicle structure has excessive corrosion which adversely affects braking or steering (6.1.a.1) Nearside front vehicle structure has excessive corrosion which adversely affects braking or steering (6.1.a.1) 01 June 2012 [17:55] 01/06/2012 755573952150 755573952150
1 Offside front brake hose seriously damaged (found during steering lock to lock check) (2.2.d.2b) Offside front brake hose seriously damaged (found during steering lock to lock check) (2.2.d.2b) 01 June 2012 [17:55] 01/06/2012 755573952150 755573952150
1 Offside front suspension has excessive play in a upper suspension ball joint (2.5.b.1a) Offside front suspension has excessive play in a upper suspension ball joint (2.5.b.1a) 20 May 2011 [10:06] 20/05/2011 637020941152 637020941152
1 Centre rear registration plate lamp not working (1.1.5c) Centre rear registration plate lamp not working (1.1.5c) 04 June 2010 [18:43] 04/06/2010 482945550156 482945550156
1 Nearside front headlamp aim too low and too far to the left. (1.8) Nearside front headlamp aim too low and too far to the left. (1.8) 04 June 2010 [18:43] 04/06/2010 482945550156 482945550156
1 Offside front vehicle structure has excessive corrosion which adversely affects braking or steering (6.1.a.1) Offside front vehicle structure has excessive corrosion which adversely affects braking or steering (6.1.a.1) 04 June 2010 [18:43] 04/06/2010 482945550156 482945550156
1 Nearside front vehicle structure has excessive corrosion, seriously affecting its strength within 30cm of the body mountings (6.1.b.2) Nearside front vehicle structure has excessive corrosion, seriously affecting its strength within 30cm of the body mountings (6.1.b.2) 04 June 2010 [18:43] 04/06/2010 482945550156 482945550156
1 Nearside front bonded suspension unit deteriorated and cannot function as intended (2.4.f.3) Nearside front bonded suspension unit deteriorated and cannot function as intended (2.4.f.3) 04 June 2010 [18:43] 04/06/2010 482945550156 482945550156
1 Offside rear rear wheel bearing has excessive play (2.6.2) Offside rear rear wheel bearing has excessive play (2.6.2) 04 June 2010 [18:43] 04/06/2010 482945550156 482945550156

ALL AOW 311A User Entered Faults [9]

ALL User Entered faults, ORDERED by OCCURRENCE DURING AOW 311A's MOT HISTORY
ALL AOW 311A User Entered Faults [9]
ALL User Entered faults, ORDERED by OCCURRENCE DURING AOW 311A's MOT HISTORY
User Entered Faults | source www.vehiclestats.co.uk
Fault Fault Test Date Test Date/Time Reference MOT Test Reference
2 N/s/f and o/s/f floor corroded N/s/f and o/s/f floor corroded 18 June 2015 [08:47] 18/06/2015 09 June 2015 [11:01] 09/06/2015 708009365152 708009365152 258940165125 258940165125
2 O/s bodywork corroded O/s bodywork corroded 18 June 2015 [08:47] 18/06/2015 09 June 2015 [11:01] 09/06/2015 708009365152 708009365152 258940165125 258940165125
2 Steering column loose rect Steering column loose rect 14 June 2014 [12:31] 14/06/2014 14 June 2014 [12:31] 14/06/2014 558735964132 558735964132 379195364100 379195364100
1 Indicator switch wearing but still servicable Indicator switch wearing but still servicable 15 June 2013 [12:14] 15/06/2013 206236963139 206236963139
1 Slight play at front trunions Slight play at front trunions 27 May 2011 [14:17] 27/05/2011 289847441142 289847441142
1 Steering column clamp bolt loose Steering column clamp bolt loose 04 June 2010 [18:43] 04/06/2010 482945550156 482945550156

ALL AOW 311A Pass With Rectification Faults [1]

ALL Pass With Rectification faults, ORDERED by OCCURRENCE DURING AOW 311A's MOT HISTORY
ALL AOW 311A Pass With Rectification Faults [1]
ALL Pass With Rectification faults, ORDERED by OCCURRENCE DURING AOW 311A's MOT HISTORY
Pass With Rectification Faults | source www.vehiclestats.co.uk
Fault Fault Test Date Test Date/Time Reference MOT Test Reference
1 Nearside rear brake lining(s) less than 1.5 mm thick (3.5.1g) Nearside rear brake lining(s) less than 1.5 mm thick (3.5.1g) 14 June 2014 [12:31] 14/06/2014 379195364100 379195364100

MOT TEST: 25 July 2017 14:40:45 PASSED
MOT TEST: 25 July 2017 14:40:45 PASSED

This test (836195572332) was completed on the 25 July 2017 14:40:45 and PASSED the requirements for a valid MOT with 1 comments.

This test (836195572332) was completed on the 25 July 2017 14:40:45 and PASSED the requirements for a valid MOT with 1 comments.

Recorded mileage: 98,995

Recorded mileage: 98,995


ADVISORY


MOT TEST: 13 June 2016 10:13:12 PASSED
MOT TEST: 13 June 2016 10:13:12 PASSED

This test (219953958434) was completed on the 13 June 2016 10:13:12 and PASSED the requirements for a valid MOT with 2 comments.

This test (219953958434) was completed on the 13 June 2016 10:13:12 and PASSED the requirements for a valid MOT with 2 comments.

Recorded mileage: 98,171

Recorded mileage: 98,171


ADVISORY


MOT TEST: 07 June 2016 09:35:38 FAILED
MOT TEST: 07 June 2016 09:35:38 FAILED

This test (224313018501) was completed on the 07 June 2016 09:35:38 and FAILED the requirements for a valid MOT with 7 comments.

This test (224313018501) was completed on the 07 June 2016 09:35:38 and FAILED the requirements for a valid MOT with 7 comments.

Recorded mileage: 98,161

Recorded mileage: 98,161


ADVISORY

FAIL


MOT TEST: 18 June 2015 08:47:07 PASSED
MOT TEST: 18 June 2015 08:47:07 PASSED

This test (708009365152) was completed on the 18 June 2015 08:47:07 and PASSED the requirements for a valid MOT with 2 comments.

This test (708009365152) was completed on the 18 June 2015 08:47:07 and PASSED the requirements for a valid MOT with 2 comments.

Recorded mileage: 97,844

Recorded mileage: 97,844


USER ENTERED


MOT TEST: 09 June 2015 11:01:48 FAILED
MOT TEST: 09 June 2015 11:01:48 FAILED

This test (258940165125) was completed on the 09 June 2015 11:01:48 and FAILED the requirements for a valid MOT with 7 comments.

This test (258940165125) was completed on the 09 June 2015 11:01:48 and FAILED the requirements for a valid MOT with 7 comments.

Recorded mileage: 97,844

Recorded mileage: 97,844


FAIL

USER ENTERED


MOT TEST: 14 June 2014 12:31:18 PASSED
MOT TEST: 14 June 2014 12:31:18 PASSED

This test (558735964132) was completed on the 14 June 2014 12:31:18 and PASSED the requirements for a valid MOT with 1 comments.

This test (558735964132) was completed on the 14 June 2014 12:31:18 and PASSED the requirements for a valid MOT with 1 comments.

Recorded mileage: 97,650

Recorded mileage: 97,650


USER ENTERED


MOT TEST: 14 June 2014 12:31:18 FAILED
MOT TEST: 14 June 2014 12:31:18 FAILED

This test (379195364100) was completed on the 14 June 2014 12:31:18 and FAILED the requirements for a valid MOT with 2 comments.

This test (379195364100) was completed on the 14 June 2014 12:31:18 and FAILED the requirements for a valid MOT with 2 comments.

Recorded mileage: 97,650

Recorded mileage: 97,650


USER ENTERED

PASS WITH RECTIFICATION


MOT TEST: 15 June 2013 12:14:57 PASSED
MOT TEST: 15 June 2013 12:14:57 PASSED

This test (206236963139) was completed on the 15 June 2013 12:14:57 and PASSED the requirements for a valid MOT with 2 comments.

This test (206236963139) was completed on the 15 June 2013 12:14:57 and PASSED the requirements for a valid MOT with 2 comments.

Recorded mileage: 96,901

Recorded mileage: 96,901


ADVISORY

USER ENTERED


MOT TEST: 10 June 2012 08:44:52 PASSED
MOT TEST: 10 June 2012 08:44:52 PASSED

This test (236152862148) was completed on the 10 June 2012 08:44:52 and PASSED the requirements for a valid MOT with 0 comments.

This test (236152862148) was completed on the 10 June 2012 08:44:52 and PASSED the requirements for a valid MOT with 0 comments.

Recorded mileage: 96,383

Recorded mileage: 96,383


MOT TEST: 01 June 2012 17:55:32 FAILED
MOT TEST: 01 June 2012 17:55:32 FAILED

This test (755573952150) was completed on the 01 June 2012 17:55:32 and FAILED the requirements for a valid MOT with 2 comments.

This test (755573952150) was completed on the 01 June 2012 17:55:32 and FAILED the requirements for a valid MOT with 2 comments.

Recorded mileage: 96,383

Recorded mileage: 96,383


FAIL


MOT TEST: 27 May 2011 14:17:19 PASSED
MOT TEST: 27 May 2011 14:17:19 PASSED

This test (289847441142) was completed on the 27 May 2011 14:17:19 and PASSED the requirements for a valid MOT with 1 comments.

This test (289847441142) was completed on the 27 May 2011 14:17:19 and PASSED the requirements for a valid MOT with 1 comments.

Recorded mileage: 94,510

Recorded mileage: 94,510


USER ENTERED


MOT TEST: 20 May 2011 10:06:04 FAILED
MOT TEST: 20 May 2011 10:06:04 FAILED

This test (637020941152) was completed on the 20 May 2011 10:06:04 and FAILED the requirements for a valid MOT with 2 comments.

This test (637020941152) was completed on the 20 May 2011 10:06:04 and FAILED the requirements for a valid MOT with 2 comments.

Recorded mileage: 94,510

Recorded mileage: 94,510


FAIL


MOT TEST: 12 June 2010 10:49:09 PASSED
MOT TEST: 12 June 2010 10:49:09 PASSED

This test (964703160196) was completed on the 12 June 2010 10:49:09 and PASSED the requirements for a valid MOT with 0 comments.

This test (964703160196) was completed on the 12 June 2010 10:49:09 and PASSED the requirements for a valid MOT with 0 comments.

Recorded mileage: 0

Recorded mileage: 0


MOT TEST: 04 June 2010 18:43:15 FAILED
MOT TEST: 04 June 2010 18:43:15 FAILED

This test (482945550156) was completed on the 04 June 2010 18:43:15 and FAILED the requirements for a valid MOT with 7 comments.

This test (482945550156) was completed on the 04 June 2010 18:43:15 and FAILED the requirements for a valid MOT with 7 comments.

Recorded mileage: 93,337

Recorded mileage: 93,337


FAIL

USER ENTERED