ARB 547A


ARB547A is registered to a Brown 1963, Morris Minor 1000 with a Petrol engine. It Failed its most recent MOT Test on the 17 July 2017

32 unique faults (42 Total) reported in its MOT History (8 Tests).

10 common/recurring faults, the most frequent (2 times) is: Offside Rear Suspension spring mounting prescribed area is excessively corroded (2.4.A.3).

62% (5) MOT Pass Rate and a 38% (3) MOT Failure Rate.

96,664 recorded miles.

ARB 547A


ARB547A is registered to a Brown 1963, Morris Minor 1000 with a Petrol engine. It Failed its most recent MOT Test on the 17 July 2017

32 unique faults (42 Total) reported in its MOT History (8 Tests).

10 common/recurring faults, the most frequent (2 times) is: Offside Rear Suspension spring mounting prescribed area is excessively corroded (2.4.A.3).

62% (5) MOT Pass Rate and a 38% (3) MOT Failure Rate.

96,664 recorded miles.

MOT PASS/Failure rate for ARB 547A

all MOT test results for ARB 547A represented as a percentage
MOT PASS/Failure rate for ARB 547A
all MOT test results for ARB 547A represented as a percentage

PERCENTAGE OF VEHICLE FAULTS WITH ARB 547A

ALL REPORTED FAULTS, DISPLAYED BY PERCENTAGE OF OCCURRENCE DURING ALL MOT TESTS
PERCENTAGE OF VEHICLE FAULTS WITH ARB 547A
ALL REPORTED FAULTS, DISPLAYED BY PERCENTAGE OF OCCURRENCE DURING ALL MOT TESTS
ADVISORY

FAIL

USER ENTERED

ARB 547A annual Faults by type

ALL REPORTED FAULTS, DISPLAYED over time and categorised by type
ARB 547A annual Faults by type
ALL REPORTED FAULTS, DISPLAYED over time and categorised by type

RECURRING FAULTS WITH ARB 547A

FAULTS THAT HAVE OCCURED MORE THAN ONCE DURING ARB 547A's MOT HISTORY
RECURRING FAULTS WITH ARB 547A
FAULTS THAT HAVE OCCURED MORE THAN ONCE DURING ARB 547A's MOT HISTORY
Fault Fault Test Date Test Date/Time Reference MOT Test Reference
2 Offside rear suspension spring mounting prescribed area is excessively corroded (2.4.a.3) Offside rear suspension spring mounting prescribed area is excessively corroded (2.4.a.3) 01 June 2016 [14:52] 01/06/2016 28 May 2012 [16:37] 28/05/2012 551580312152 551580312152 906429142171 906429142171
2 N/s front chassis showing some swelling/corrsion N/s front chassis showing some swelling/corrsion 10 June 2013 [13:18] 10/06/2013 07 June 2013 [09:29] 07/06/2013 235141863131 235141863131 838188653109 838188653109
2 N/s centre cross chassis showing some advance corrsion/deterioation N/s centre cross chassis showing some advance corrsion/deterioation 10 June 2013 [13:18] 10/06/2013 07 June 2013 [09:29] 07/06/2013 235141863131 235141863131 838188653109 838188653109
2 Jacking points weak Jacking points weak 10 June 2013 [13:18] 10/06/2013 07 June 2013 [09:29] 07/06/2013 235141863131 235141863131 838188653109 838188653109
2 N/s screen wash poor N/s screen wash poor 10 June 2013 [13:18] 10/06/2013 07 June 2013 [09:29] 07/06/2013 235141863131 235141863131 838188653109 838188653109
2 N/s front chassis rail some swelling/corrsion N/s front chassis rail some swelling/corrsion 08 June 2012 [15:48] 08/06/2012 28 May 2012 [16:37] 28/05/2012 625010862183 625010862183 906429142171 906429142171
2 Centre crossrail showing swelling/corrsion Centre crossrail showing swelling/corrsion 08 June 2012 [15:48] 08/06/2012 28 May 2012 [16:37] 28/05/2012 625010862183 625010862183 906429142171 906429142171
2 O/s inner wheel arch holed O/s inner wheel arch holed 08 June 2012 [15:48] 08/06/2012 28 May 2012 [16:37] 28/05/2012 625010862183 625010862183 906429142171 906429142171
2 O/s resr shockadsorber signs of leak O/s resr shockadsorber signs of leak 08 June 2012 [15:48] 08/06/2012 28 May 2012 [16:37] 28/05/2012 625010862183 625010862183 906429142171 906429142171
2 Hole in n/s inner front wing Hole in n/s inner front wing 08 June 2012 [15:48] 08/06/2012 28 May 2012 [16:37] 28/05/2012 625010862183 625010862183 906429142171 906429142171

ALL ARB 547A ADVISORIES [3]

ALL ADVISORIES, ORDERED by OCCURRENCE DURING ARB 547A's MOT HISTORY
ALL ARB 547A ADVISORIES [3]
ALL ADVISORIES, ORDERED by OCCURRENCE DURING ARB 547A's MOT HISTORY
Fail Faults | source www.vehiclestats.co.uk
Fault Fault Test Date Test Date/Time Reference MOT Test Reference
1 O/s front bump stop missing O/s front bump stop missing 01 June 2016 [14:52] 01/06/2016 551580312152 551580312152
1 Offside front upper steering pivot point has slight play (2.2.b.1g) Offside front upper steering pivot point has slight play (2.2.b.1g) 28 May 2012 [16:37] 28/05/2012 906429142171 906429142171
1 Offside rear service brake: service brake efficiency only just met. It would appear that the braking system requires adjustment or repair. (3.7.b.7) Offside rear service brake: service brake efficiency only just met. It would appear that the braking system requires adjustment or repair. (3.7.b.7) 28 May 2012 [16:37] 28/05/2012 906429142171 906429142171

ALL ARB 547A Failure Faults [21]

ALL Failure faults, ORDERED by OCCURRENCE DURING ARB 547A's MOT HISTORY
ALL ARB 547A Failure Faults [21]
ALL Failure faults, ORDERED by OCCURRENCE DURING ARB 547A's MOT HISTORY
Fail Faults | source www.vehiclestats.co.uk
Fault Fault Test Date Test Date/Time Reference MOT Test Reference
2 Offside rear suspension spring mounting prescribed area is excessively corroded (2.4.a.3) Offside rear suspension spring mounting prescribed area is excessively corroded (2.4.a.3) 01 June 2016 [14:52] 01/06/2016 28 May 2012 [16:37] 28/05/2012 551580312152 551580312152 906429142171 906429142171
1 Offside rear position lamp(s) not working (1.1.a.3b) Offside rear position lamp(s) not working (1.1.a.3b) 01 June 2016 [14:52] 01/06/2016 551580312152 551580312152
1 Windscreen washer provides insufficient washer liquid (8.2.3) Windscreen washer provides insufficient washer liquid (8.2.3) 01 June 2016 [14:52] 01/06/2016 551580312152 551580312152
1 Offside front vehicle structure has an inadequate repair, seriously affecting its strength within 30cm of the body mountings (6.1.b.2) Offside front vehicle structure has an inadequate repair, seriously affecting its strength within 30cm of the body mountings (6.1.b.2) 01 June 2016 [14:52] 01/06/2016 551580312152 551580312152
1 Nearside front vehicle structure has an inadequate repair, seriously affecting its strength within 30cm of the body mountings (6.1.b.2) Nearside front vehicle structure has an inadequate repair, seriously affecting its strength within 30cm of the body mountings (6.1.b.2) 01 June 2016 [14:52] 01/06/2016 551580312152 551580312152
1 Offside body or chassis has excessive corrosion, seriously affecting its strength within 30cm of the body mountings (6.1.b.2) Offside body or chassis has excessive corrosion, seriously affecting its strength within 30cm of the body mountings (6.1.b.2) 01 June 2016 [14:52] 01/06/2016 551580312152 551580312152
1 Centre body or chassis has excessive corrosion, seriously affecting its strength within 30cm of the body mountings crossmember (6.1.b.2) Centre body or chassis has excessive corrosion, seriously affecting its strength within 30cm of the body mountings crossmember (6.1.b.2) 01 June 2016 [14:52] 01/06/2016 551580312152 551580312152
1 Nearside steering rack gaiter split (2.2.d.2d) Nearside steering rack gaiter split (2.2.d.2d) 01 June 2016 [14:52] 01/06/2016 551580312152 551580312152
1 Offside steering rack gaiter split (2.2.d.2d) Offside steering rack gaiter split (2.2.d.2d) 01 June 2016 [14:52] 01/06/2016 551580312152 551580312152
1 Nearside rear mechanical brake component has restricted free movement (3.5.1k) Nearside rear mechanical brake component has restricted free movement (3.5.1k) 01 June 2016 [14:52] 01/06/2016 551580312152 551580312152
1 Offside rear mechanical brake component has restricted free movement (3.5.1k) Offside rear mechanical brake component has restricted free movement (3.5.1k) 01 June 2016 [14:52] 01/06/2016 551580312152 551580312152
1 Offside headlamp aim beam image obviously incorrect (1.8.a.1b) Offside headlamp aim beam image obviously incorrect (1.8.a.1b) 01 June 2016 [14:52] 01/06/2016 551580312152 551580312152
1 Nearside rear suspension spring mounting prescribed area is excessively corroded (2.4.a.3) Nearside rear suspension spring mounting prescribed area is excessively corroded (2.4.a.3) 01 June 2016 [14:52] 01/06/2016 551580312152 551580312152
1 Nearside body or chassis has excessive corrosion, seriously affecting its strength within 30cm of the body mountings (6.1.b.2) Nearside body or chassis has excessive corrosion, seriously affecting its strength within 30cm of the body mountings (6.1.b.2) 01 June 2016 [14:52] 01/06/2016 551580312152 551580312152
1 Nearside front position lamp(s) not working (1.1.a.3b) Nearside front position lamp(s) not working (1.1.a.3b) 07 June 2013 [09:29] 07/06/2013 838188653109 838188653109
1 Nearside track rod end ball joint dust cover excessively deteriorated so that it no longer prevents the ingress of dirt (2.2.c.1c) Nearside track rod end ball joint dust cover excessively deteriorated so that it no longer prevents the ingress of dirt (2.2.c.1c) 07 June 2013 [09:29] 07/06/2013 838188653109 838188653109
1 Offside front lower steering pivot point has excessive play (2.2.b.1g) Offside front lower steering pivot point has excessive play (2.2.b.1g) 28 May 2012 [16:37] 28/05/2012 906429142171 906429142171
1 Exhaust has a major leak of exhaust gases (7.1.2) Exhaust has a major leak of exhaust gases (7.1.2) 28 May 2012 [16:37] 28/05/2012 906429142171 906429142171
1 Offside front tyre has a lump, caused by separation or partial failure of its structure (4.1.d.1b) Offside front tyre has a lump, caused by separation or partial failure of its structure (4.1.d.1b) 28 May 2012 [16:37] 28/05/2012 906429142171 906429142171
1 Parking brake: efficiency below requirements (3.7.b.7) Parking brake: efficiency below requirements (3.7.b.7) 28 May 2012 [16:37] 28/05/2012 906429142171 906429142171

ALL ARB 547A User Entered Faults [18]

ALL User Entered faults, ORDERED by OCCURRENCE DURING ARB 547A's MOT HISTORY
ALL ARB 547A User Entered Faults [18]
ALL User Entered faults, ORDERED by OCCURRENCE DURING ARB 547A's MOT HISTORY
User Entered Faults | source www.vehiclestats.co.uk
Fault Fault Test Date Test Date/Time Reference MOT Test Reference
2 N/s front chassis showing some swelling/corrsion N/s front chassis showing some swelling/corrsion 10 June 2013 [13:18] 10/06/2013 07 June 2013 [09:29] 07/06/2013 235141863131 235141863131 838188653109 838188653109
2 N/s centre cross chassis showing some advance corrsion/deterioation N/s centre cross chassis showing some advance corrsion/deterioation 10 June 2013 [13:18] 10/06/2013 07 June 2013 [09:29] 07/06/2013 235141863131 235141863131 838188653109 838188653109
2 Jacking points weak Jacking points weak 10 June 2013 [13:18] 10/06/2013 07 June 2013 [09:29] 07/06/2013 235141863131 235141863131 838188653109 838188653109
2 N/s screen wash poor N/s screen wash poor 10 June 2013 [13:18] 10/06/2013 07 June 2013 [09:29] 07/06/2013 235141863131 235141863131 838188653109 838188653109
2 N/s front chassis rail some swelling/corrsion N/s front chassis rail some swelling/corrsion 08 June 2012 [15:48] 08/06/2012 28 May 2012 [16:37] 28/05/2012 625010862183 625010862183 906429142171 906429142171
2 Centre crossrail showing swelling/corrsion Centre crossrail showing swelling/corrsion 08 June 2012 [15:48] 08/06/2012 28 May 2012 [16:37] 28/05/2012 625010862183 625010862183 906429142171 906429142171
2 O/s inner wheel arch holed O/s inner wheel arch holed 08 June 2012 [15:48] 08/06/2012 28 May 2012 [16:37] 28/05/2012 625010862183 625010862183 906429142171 906429142171
2 O/s resr shockadsorber signs of leak O/s resr shockadsorber signs of leak 08 June 2012 [15:48] 08/06/2012 28 May 2012 [16:37] 28/05/2012 625010862183 625010862183 906429142171 906429142171
2 Hole in n/s inner front wing Hole in n/s inner front wing 08 June 2012 [15:48] 08/06/2012 28 May 2012 [16:37] 28/05/2012 625010862183 625010862183 906429142171 906429142171

MOT TEST: 17 July 2017 16:17:40 PASSED
MOT TEST: 17 July 2017 16:17:40 PASSED

This test (957738390634) was completed on the 17 July 2017 16:17:40 and PASSED the requirements for a valid MOT with 0 comments.

This test (957738390634) was completed on the 17 July 2017 16:17:40 and PASSED the requirements for a valid MOT with 0 comments.

Recorded mileage: 96,664

Recorded mileage: 96,664


MOT TEST: 01 June 2016 14:52:32 FAILED
MOT TEST: 01 June 2016 14:52:32 FAILED

This test (551580312152) was completed on the 01 June 2016 14:52:32 and FAILED the requirements for a valid MOT with 15 comments.

This test (551580312152) was completed on the 01 June 2016 14:52:32 and FAILED the requirements for a valid MOT with 15 comments.

Recorded mileage: 96,638

Recorded mileage: 96,638


ADVISORY

FAIL


MOT TEST: 01 June 2015 10:52:18 PASSED
MOT TEST: 01 June 2015 10:52:18 PASSED

This test (337232955128) was completed on the 01 June 2015 10:52:18 and PASSED the requirements for a valid MOT with 0 comments.

This test (337232955128) was completed on the 01 June 2015 10:52:18 and PASSED the requirements for a valid MOT with 0 comments.

Recorded mileage: 96,164

Recorded mileage: 96,164


MOT TEST: 06 June 2014 15:52:11 PASSED
MOT TEST: 06 June 2014 15:52:11 PASSED

This test (847317454184) was completed on the 06 June 2014 15:52:11 and PASSED the requirements for a valid MOT with 0 comments.

This test (847317454184) was completed on the 06 June 2014 15:52:11 and PASSED the requirements for a valid MOT with 0 comments.

Recorded mileage: 95,435

Recorded mileage: 95,435


MOT TEST: 10 June 2013 13:18:50 PASSED
MOT TEST: 10 June 2013 13:18:50 PASSED

This test (235141863131) was completed on the 10 June 2013 13:18:50 and PASSED the requirements for a valid MOT with 4 comments.

This test (235141863131) was completed on the 10 June 2013 13:18:50 and PASSED the requirements for a valid MOT with 4 comments.

Recorded mileage: 94,040

Recorded mileage: 94,040


USER ENTERED


MOT TEST: 07 June 2013 09:29:26 FAILED
MOT TEST: 07 June 2013 09:29:26 FAILED

This test (838188653109) was completed on the 07 June 2013 09:29:26 and FAILED the requirements for a valid MOT with 6 comments.

This test (838188653109) was completed on the 07 June 2013 09:29:26 and FAILED the requirements for a valid MOT with 6 comments.

Recorded mileage: 94,040

Recorded mileage: 94,040


FAIL

USER ENTERED


MOT TEST: 08 June 2012 15:48:55 PASSED
MOT TEST: 08 June 2012 15:48:55 PASSED

This test (625010862183) was completed on the 08 June 2012 15:48:55 and PASSED the requirements for a valid MOT with 5 comments.

This test (625010862183) was completed on the 08 June 2012 15:48:55 and PASSED the requirements for a valid MOT with 5 comments.

Recorded mileage: 93,539

Recorded mileage: 93,539


USER ENTERED


MOT TEST: 28 May 2012 16:37:52 FAILED
MOT TEST: 28 May 2012 16:37:52 FAILED

This test (906429142171) was completed on the 28 May 2012 16:37:52 and FAILED the requirements for a valid MOT with 12 comments.

This test (906429142171) was completed on the 28 May 2012 16:37:52 and FAILED the requirements for a valid MOT with 12 comments.

Recorded mileage: 93,537

Recorded mileage: 93,537


ADVISORY

FAIL

USER ENTERED