ARB 552A


ARB552A is registered to a Grey 1963, Morris Minor 1000 with a Petrol engine. It Failed its most recent MOT Test on the 21 June 2017

19 unique faults (19 Total) reported in its MOT History (16 Tests).

0 common/recurring faults.

69% (11) MOT Pass Rate and a 31% (5) MOT Failure Rate.

24,418 recorded miles.

ARB 552A


ARB552A is registered to a Grey 1963, Morris Minor 1000 with a Petrol engine. It Failed its most recent MOT Test on the 21 June 2017

19 unique faults (19 Total) reported in its MOT History (16 Tests).

0 common/recurring faults.

69% (11) MOT Pass Rate and a 31% (5) MOT Failure Rate.

24,418 recorded miles.

MOT PASS/Failure rate for ARB 552A

all MOT test results for ARB 552A represented as a percentage
MOT PASS/Failure rate for ARB 552A
all MOT test results for ARB 552A represented as a percentage

PERCENTAGE OF VEHICLE FAULTS WITH ARB 552A

ALL REPORTED FAULTS, DISPLAYED BY PERCENTAGE OF OCCURRENCE DURING ALL MOT TESTS
PERCENTAGE OF VEHICLE FAULTS WITH ARB 552A
ALL REPORTED FAULTS, DISPLAYED BY PERCENTAGE OF OCCURRENCE DURING ALL MOT TESTS
ADVISORY

FAIL

USER ENTERED

PASS WITH RECTIFICATION

ARB 552A annual Faults by type

ALL REPORTED FAULTS, DISPLAYED over time and categorised by type
ARB 552A annual Faults by type
ALL REPORTED FAULTS, DISPLAYED over time and categorised by type

ALL ARB 552A ADVISORIES [3]

ALL ADVISORIES, ORDERED by OCCURRENCE DURING ARB 552A's MOT HISTORY
ALL ARB 552A ADVISORIES [3]
ALL ADVISORIES, ORDERED by OCCURRENCE DURING ARB 552A's MOT HISTORY
Advisory Faults | source www.vehiclestats.co.uk
Fault Fault Test Date Test Date/Time Reference MOT Test Reference
1 Nearside front upper suspension arm has slight play in a pin/bush (2.4.g.2) Nearside front upper suspension arm has slight play in a pin/bush (2.4.g.2) 21 June 2017 [11:54] 21/06/2017 411394690625 411394690625
1 Nearside front tyre worn close to the legal limit (4.1.e.1) Nearside front tyre worn close to the legal limit (4.1.e.1) 27 June 2015 [09:16] 27/06/2015 447428675133 447428675133
1 Offside front tyre worn close to the legal limit (4.1.e.1) Offside front tyre worn close to the legal limit (4.1.e.1) 27 June 2015 [09:16] 27/06/2015 447428675133 447428675133

ALL ARB 552A Failure Faults [13]

ALL Failure faults, ORDERED by OCCURRENCE DURING ARB 552A's MOT HISTORY
ALL ARB 552A Failure Faults [13]
ALL Failure faults, ORDERED by OCCURRENCE DURING ARB 552A's MOT HISTORY
Fail Faults | source www.vehiclestats.co.uk
Fault Fault Test Date Test Date/Time Reference MOT Test Reference
1 Nearside front direction indicator not working (1.4.a.2c) Nearside front direction indicator not working (1.4.a.2c) 27 June 2015 [09:16] 27/06/2015 447428675133 447428675133
1 Offside seat belt anchorage prescribed area is excessively corroded (5.2.6) Offside seat belt anchorage prescribed area is excessively corroded (5.2.6) 09 January 2014 [10:51] 09/01/2014 187019704485 187019704485
1 Horn not working (1.6.2a) Horn not working (1.6.2a) 09 January 2014 [10:51] 09/01/2014 187019704485 187019704485
1 Offside headlamp not working on dipped beam (1.7.5a) Offside headlamp not working on dipped beam (1.7.5a) 09 January 2013 [12:29] 09/01/2013 455259803050 455259803050
1 Offside headlamp not working on main beam (1.7.5a) Offside headlamp not working on main beam (1.7.5a) 09 January 2013 [12:29] 09/01/2013 455259803050 455259803050
1 Offside front direction indicator not working (1.4.a.2c) Offside front direction indicator not working (1.4.a.2c) 09 January 2013 [12:29] 09/01/2013 455259803050 455259803050
1 Offside rear direction indicator flashing less than 60 times a minute (1.4.a.2g) Offside rear direction indicator flashing less than 60 times a minute (1.4.a.2g) 09 January 2013 [12:29] 09/01/2013 455259803050 455259803050
1 Offside steering rack gaiter insecure (2.2.d.2d) Offside steering rack gaiter insecure (2.2.d.2d) 09 January 2013 [12:29] 09/01/2013 455259803050 455259803050
1 Offside windscreen wiper does not clear the windscreen effectively (8.2.2) Offside windscreen wiper does not clear the windscreen effectively (8.2.2) 09 January 2013 [12:29] 09/01/2013 455259803050 455259803050
1 Drivers seat fore and aft adjustment mechanism not functioning as intended. (6.2.a.3) Drivers seat fore and aft adjustment mechanism not functioning as intended. (6.2.a.3) 09 January 2013 [12:29] 09/01/2013 455259803050 455259803050
1 Parking brake: efficiency below requirements (3.7.c.1b) Parking brake: efficiency below requirements (3.7.c.1b) 17 September 2007 [12:33] 17/09/2007 671100467224 671100467224
1 Offside steering rack gaiter split (2.2.d.2d) Offside steering rack gaiter split (2.2.d.2d) 17 September 2007 [12:33] 17/09/2007 671100467224 671100467224
1 Parking brake: efficiency below requirements (3.7.b.7) Parking brake: efficiency below requirements (3.7.b.7) 12 September 2005 [16:07] 12/09/2005 363695355463 363695355463

ALL ARB 552A User Entered Faults [1]

ALL User Entered faults, ORDERED by OCCURRENCE DURING ARB 552A's MOT HISTORY
ALL ARB 552A User Entered Faults [1]
ALL User Entered faults, ORDERED by OCCURRENCE DURING ARB 552A's MOT HISTORY
User Entered Faults | source www.vehiclestats.co.uk
Fault Fault Test Date Test Date/Time Reference MOT Test Reference
1 Battery low Battery low 02 August 2011 [11:31] 02/08/2011 836074911265 836074911265

ALL ARB 552A Pass With Rectification Faults [2]

ALL Pass With Rectification faults, ORDERED by OCCURRENCE DURING ARB 552A's MOT HISTORY
ALL ARB 552A Pass With Rectification Faults [2]
ALL Pass With Rectification faults, ORDERED by OCCURRENCE DURING ARB 552A's MOT HISTORY
Fail Faults | source www.vehiclestats.co.uk
Fault Fault Test Date Test Date/Time Reference MOT Test Reference
1 Nearside rear direction indicator incorrect colour (1.4.a.2f) Nearside rear direction indicator incorrect colour (1.4.a.2f) 17 September 2007 [12:33] 17/09/2007 671100467224 671100467224
1 Offside rear direction indicator incorrect colour (1.4.a.2f) Offside rear direction indicator incorrect colour (1.4.a.2f) 17 September 2007 [12:33] 17/09/2007 671100467224 671100467224

MOT TEST: 21 June 2017 11:54:54 PASSED
MOT TEST: 21 June 2017 11:54:54 PASSED

This test (411394690625) was completed on the 21 June 2017 11:54:54 and PASSED the requirements for a valid MOT with 1 comments.

This test (411394690625) was completed on the 21 June 2017 11:54:54 and PASSED the requirements for a valid MOT with 1 comments.

Recorded mileage: 24,418

Recorded mileage: 24,418


ADVISORY


MOT TEST: 31 July 2015 09:39:33 PASSED
MOT TEST: 31 July 2015 09:39:33 PASSED

This test (336482915250) was completed on the 31 July 2015 09:39:33 and PASSED the requirements for a valid MOT with 0 comments.

This test (336482915250) was completed on the 31 July 2015 09:39:33 and PASSED the requirements for a valid MOT with 0 comments.

Recorded mileage: 23,903

Recorded mileage: 23,903


MOT TEST: 27 June 2015 09:16:52 FAILED
MOT TEST: 27 June 2015 09:16:52 FAILED

This test (447428675133) was completed on the 27 June 2015 09:16:52 and FAILED the requirements for a valid MOT with 3 comments.

This test (447428675133) was completed on the 27 June 2015 09:16:52 and FAILED the requirements for a valid MOT with 3 comments.

Recorded mileage: 23,890

Recorded mileage: 23,890


ADVISORY

FAIL


MOT TEST: 09 January 2014 11:20:43 PASSED
MOT TEST: 09 January 2014 11:20:43 PASSED

This test (786139704081) was completed on the 09 January 2014 11:20:43 and PASSED the requirements for a valid MOT with 0 comments.

This test (786139704081) was completed on the 09 January 2014 11:20:43 and PASSED the requirements for a valid MOT with 0 comments.

Recorded mileage: 22,834

Recorded mileage: 22,834


MOT TEST: 09 January 2014 10:51:10 FAILED
MOT TEST: 09 January 2014 10:51:10 FAILED

This test (187019704485) was completed on the 09 January 2014 10:51:10 and FAILED the requirements for a valid MOT with 2 comments.

This test (187019704485) was completed on the 09 January 2014 10:51:10 and FAILED the requirements for a valid MOT with 2 comments.

Recorded mileage: 22,834

Recorded mileage: 22,834


FAIL


MOT TEST: 09 January 2013 16:39:04 PASSED
MOT TEST: 09 January 2013 16:39:04 PASSED

This test (395939703093) was completed on the 09 January 2013 16:39:04 and PASSED the requirements for a valid MOT with 0 comments.

This test (395939703093) was completed on the 09 January 2013 16:39:04 and PASSED the requirements for a valid MOT with 0 comments.

Recorded mileage: 19,256

Recorded mileage: 19,256


MOT TEST: 09 January 2013 12:29:01 FAILED
MOT TEST: 09 January 2013 12:29:01 FAILED

This test (455259803050) was completed on the 09 January 2013 12:29:01 and FAILED the requirements for a valid MOT with 7 comments.

This test (455259803050) was completed on the 09 January 2013 12:29:01 and FAILED the requirements for a valid MOT with 7 comments.

Recorded mileage: 19,248

Recorded mileage: 19,248


FAIL


MOT TEST: 02 August 2011 11:31:13 PASSED
MOT TEST: 02 August 2011 11:31:13 PASSED

This test (836074911265) was completed on the 02 August 2011 11:31:13 and PASSED the requirements for a valid MOT with 1 comments.

This test (836074911265) was completed on the 02 August 2011 11:31:13 and PASSED the requirements for a valid MOT with 1 comments.

Recorded mileage: 19,228

Recorded mileage: 19,228


USER ENTERED


MOT TEST: 20 July 2010 16:07:27 PASSED
MOT TEST: 20 July 2010 16:07:27 PASSED

This test (973211100251) was completed on the 20 July 2010 16:07:27 and PASSED the requirements for a valid MOT with 0 comments.

This test (973211100251) was completed on the 20 July 2010 16:07:27 and PASSED the requirements for a valid MOT with 0 comments.

Recorded mileage: 18,975

Recorded mileage: 18,975


MOT TEST: 14 July 2009 15:50:47 PASSED
MOT TEST: 14 July 2009 15:50:47 PASSED

This test (583755599112) was completed on the 14 July 2009 15:50:47 and PASSED the requirements for a valid MOT with 0 comments.

This test (583755599112) was completed on the 14 July 2009 15:50:47 and PASSED the requirements for a valid MOT with 0 comments.

Recorded mileage: 18,841

Recorded mileage: 18,841


MOT TEST: 04 April 2008 16:54:49 PASSED
MOT TEST: 04 April 2008 16:54:49 PASSED

This test (683805098050) was completed on the 04 April 2008 16:54:49 and PASSED the requirements for a valid MOT with 0 comments.

This test (683805098050) was completed on the 04 April 2008 16:54:49 and PASSED the requirements for a valid MOT with 0 comments.

Recorded mileage: 18,399

Recorded mileage: 18,399


MOT TEST: 01 October 2007 16:09:19 PASSED
MOT TEST: 01 October 2007 16:09:19 PASSED

This test (982214877295) was completed on the 01 October 2007 16:09:19 and PASSED the requirements for a valid MOT with 0 comments.

This test (982214877295) was completed on the 01 October 2007 16:09:19 and PASSED the requirements for a valid MOT with 0 comments.

Recorded mileage: 18,491

Recorded mileage: 18,491


MOT TEST: 17 September 2007 12:33:04 FAILED
MOT TEST: 17 September 2007 12:33:04 FAILED

This test (671100467224) was completed on the 17 September 2007 12:33:04 and FAILED the requirements for a valid MOT with 4 comments.

This test (671100467224) was completed on the 17 September 2007 12:33:04 and FAILED the requirements for a valid MOT with 4 comments.

Recorded mileage: 18,459

Recorded mileage: 18,459


FAIL

PASS WITH RECTIFICATION


MOT TEST: 13 September 2006 10:18:27 PASSED
MOT TEST: 13 September 2006 10:18:27 PASSED

This test (611986156201) was completed on the 13 September 2006 10:18:27 and PASSED the requirements for a valid MOT with 0 comments.

This test (611986156201) was completed on the 13 September 2006 10:18:27 and PASSED the requirements for a valid MOT with 0 comments.

Recorded mileage: 18,171

Recorded mileage: 18,171


MOT TEST: 14 September 2005 15:36:51 PASSED
MOT TEST: 14 September 2005 15:36:51 PASSED

This test (143627455270) was completed on the 14 September 2005 15:36:51 and PASSED the requirements for a valid MOT with 0 comments.

This test (143627455270) was completed on the 14 September 2005 15:36:51 and PASSED the requirements for a valid MOT with 0 comments.

Recorded mileage: 17,988

Recorded mileage: 17,988


MOT TEST: 12 September 2005 16:07:59 FAILED
MOT TEST: 12 September 2005 16:07:59 FAILED

This test (363695355463) was completed on the 12 September 2005 16:07:59 and FAILED the requirements for a valid MOT with 1 comments.

This test (363695355463) was completed on the 12 September 2005 16:07:59 and FAILED the requirements for a valid MOT with 1 comments.

Recorded mileage: 17,988

Recorded mileage: 17,988


FAIL