AUJ 656A


AUJ656A is registered to a Grey 1963, Morris Minor 1000 with a Petrol engine. It Failed its most recent MOT Test on the 06 November 2012

8 unique faults (9 Total) reported in its MOT History (8 Tests).

1 common/recurring faults.

75% (6) MOT Pass Rate and a 25% (2) MOT Failure Rate.

3,650 recorded miles.

AUJ 656A


AUJ656A is registered to a Grey 1963, Morris Minor 1000 with a Petrol engine. It Failed its most recent MOT Test on the 06 November 2012

8 unique faults (9 Total) reported in its MOT History (8 Tests).

1 common/recurring faults.

75% (6) MOT Pass Rate and a 25% (2) MOT Failure Rate.

3,650 recorded miles.

MOT PASS/Failure rate for AUJ 656A

all MOT test results for AUJ 656A represented as a percentage
MOT PASS/Failure rate for AUJ 656A
all MOT test results for AUJ 656A represented as a percentage

PERCENTAGE OF VEHICLE FAULTS WITH AUJ 656A

ALL REPORTED FAULTS, DISPLAYED BY PERCENTAGE OF OCCURRENCE DURING ALL MOT TESTS
PERCENTAGE OF VEHICLE FAULTS WITH AUJ 656A
ALL REPORTED FAULTS, DISPLAYED BY PERCENTAGE OF OCCURRENCE DURING ALL MOT TESTS
ADVISORY

PASS WITH RECTIFICATION

AUJ 656A annual Faults by type

ALL REPORTED FAULTS, DISPLAYED over time and categorised by type
AUJ 656A annual Faults by type
ALL REPORTED FAULTS, DISPLAYED over time and categorised by type

ALL AUJ 656A ADVISORIES [6]

ALL ADVISORIES, ORDERED by OCCURRENCE DURING AUJ 656A's MOT HISTORY
ALL AUJ 656A ADVISORIES [6]
ALL ADVISORIES, ORDERED by OCCURRENCE DURING AUJ 656A's MOT HISTORY
Advisory Faults | source www.vehiclestats.co.uk
Fault Fault Test Date Test Date/Time Reference MOT Test Reference
2 Offside front lower front suspension has slight movement at a suspension ball joint (2.5.a.1c) Offside front lower front suspension has slight movement at a suspension ball joint (2.5.a.1c) 17 June 2006 [10:28] 17/06/2006 17 June 2006 [10:28] 17/06/2006 262268966182 262268966182 403898966151 403898966151
1 Offside rear suspension spring mounting prescribed area is corroded but not considered excessive (2.4.a.3) Offside rear suspension spring mounting prescribed area is corroded but not considered excessive (2.4.a.3) 08 November 2011 [11:43] 08/11/2011 429572811409 429572811409
1 Steering column top bearing slightly worn (2.1.2c) Steering column top bearing slightly worn (2.1.2c) 13 June 2008 [15:21] 13/06/2008 684225168150 684225168150
1 Offside rear lower sub-frame has slight play in a pin/bush (2.4.g.2) Offside rear lower sub-frame has slight play in a pin/bush (2.4.g.2) 13 June 2008 [15:21] 13/06/2008 684225168150 684225168150
1 Nearside front lower suspension arm attachment bracket/mounting worn but its strength is not seriously reduced (2.4.g.1) Nearside front lower suspension arm attachment bracket/mounting worn but its strength is not seriously reduced (2.4.g.1) 13 June 2008 [15:21] 13/06/2008 684225168150 684225168150

ALL AUJ 656A Pass With Rectification Faults [3]

ALL Pass With Rectification faults, ORDERED by OCCURRENCE DURING AUJ 656A's MOT HISTORY
ALL AUJ 656A Pass With Rectification Faults [3]
ALL Pass With Rectification faults, ORDERED by OCCURRENCE DURING AUJ 656A's MOT HISTORY
Pass With Rectification Faults | source www.vehiclestats.co.uk
Fault Fault Test Date Test Date/Time Reference MOT Test Reference
1 Offside front headlamp not working on main beam (1.7.5a) Offside front headlamp not working on main beam (1.7.5a) 07 June 2007 [09:51] 07/06/2007 601098057181 601098057181
1 Nearside front headlamp aim too high (hotspot upper edge above the horizontal 0% line) (1.6.d1) Nearside front headlamp aim too high (hotspot upper edge above the horizontal 0% line) (1.6.d1) 17 June 2006 [10:28] 17/06/2006 403898966151 403898966151
1 Offside front headlamp aim too high (hotspot upper edge above the horizontal 0% line) (1.6.d1) Offside front headlamp aim too high (hotspot upper edge above the horizontal 0% line) (1.6.d1) 17 June 2006 [10:28] 17/06/2006 403898966151 403898966151

MOT TEST: 06 November 2012 17:22:57 PASSED
MOT TEST: 06 November 2012 17:22:57 PASSED

This test (669471812343) was completed on the 06 November 2012 17:22:57 and PASSED the requirements for a valid MOT with 0 comments.

This test (669471812343) was completed on the 06 November 2012 17:22:57 and PASSED the requirements for a valid MOT with 0 comments.

Recorded mileage: 3,650

Recorded mileage: 3,650


MOT TEST: 08 November 2011 11:43:48 PASSED
MOT TEST: 08 November 2011 11:43:48 PASSED

This test (429572811409) was completed on the 08 November 2011 11:43:48 and PASSED the requirements for a valid MOT with 1 comments.

This test (429572811409) was completed on the 08 November 2011 11:43:48 and PASSED the requirements for a valid MOT with 1 comments.

Recorded mileage: 3,331

Recorded mileage: 3,331


ADVISORY


MOT TEST: 11 June 2009 15:27:58 PASSED
MOT TEST: 11 June 2009 15:27:58 PASSED

This test (742282369153) was completed on the 11 June 2009 15:27:58 and PASSED the requirements for a valid MOT with 0 comments.

This test (742282369153) was completed on the 11 June 2009 15:27:58 and PASSED the requirements for a valid MOT with 0 comments.

Recorded mileage: 3,004

Recorded mileage: 3,004


MOT TEST: 13 June 2008 15:21:22 PASSED
MOT TEST: 13 June 2008 15:21:22 PASSED

This test (684225168150) was completed on the 13 June 2008 15:21:22 and PASSED the requirements for a valid MOT with 3 comments.

This test (684225168150) was completed on the 13 June 2008 15:21:22 and PASSED the requirements for a valid MOT with 3 comments.

Recorded mileage: 2,109

Recorded mileage: 2,109


ADVISORY


MOT TEST: 07 June 2007 09:51:13 PASSED
MOT TEST: 07 June 2007 09:51:13 PASSED

This test (164258357151) was completed on the 07 June 2007 09:51:13 and PASSED the requirements for a valid MOT with 0 comments.

This test (164258357151) was completed on the 07 June 2007 09:51:13 and PASSED the requirements for a valid MOT with 0 comments.

Recorded mileage: 380

Recorded mileage: 380


MOT TEST: 07 June 2007 09:51:13 FAILED
MOT TEST: 07 June 2007 09:51:13 FAILED

This test (601098057181) was completed on the 07 June 2007 09:51:13 and FAILED the requirements for a valid MOT with 1 comments.

This test (601098057181) was completed on the 07 June 2007 09:51:13 and FAILED the requirements for a valid MOT with 1 comments.

Recorded mileage: 380

Recorded mileage: 380


PASS WITH RECTIFICATION


MOT TEST: 17 June 2006 10:28:57 PASSED
MOT TEST: 17 June 2006 10:28:57 PASSED

This test (262268966182) was completed on the 17 June 2006 10:28:57 and PASSED the requirements for a valid MOT with 1 comments.

This test (262268966182) was completed on the 17 June 2006 10:28:57 and PASSED the requirements for a valid MOT with 1 comments.

Recorded mileage: 1,021

Recorded mileage: 1,021


ADVISORY


MOT TEST: 17 June 2006 10:28:57 FAILED
MOT TEST: 17 June 2006 10:28:57 FAILED

This test (403898966151) was completed on the 17 June 2006 10:28:57 and FAILED the requirements for a valid MOT with 3 comments.

This test (403898966151) was completed on the 17 June 2006 10:28:57 and FAILED the requirements for a valid MOT with 3 comments.

Recorded mileage: 1,021

Recorded mileage: 1,021


ADVISORY

PASS WITH RECTIFICATION