BHK 227A


BHK227A is registered to a Blue 1963, Morris Minor 1000 with a Petrol engine. It Failed its most recent MOT Test on the 18 July 2017

24 unique faults (25 Total) reported in its MOT History (10 Tests).

1 common/recurring faults.

70% (7) MOT Pass Rate and a 30% (3) MOT Failure Rate.

76,367 recorded miles.

BHK 227A


BHK227A is registered to a Blue 1963, Morris Minor 1000 with a Petrol engine. It Failed its most recent MOT Test on the 18 July 2017

24 unique faults (25 Total) reported in its MOT History (10 Tests).

1 common/recurring faults.

70% (7) MOT Pass Rate and a 30% (3) MOT Failure Rate.

76,367 recorded miles.

MOT PASS/Failure rate for BHK 227A

all MOT test results for BHK 227A represented as a percentage
MOT PASS/Failure rate for BHK 227A
all MOT test results for BHK 227A represented as a percentage

PERCENTAGE OF VEHICLE FAULTS WITH BHK 227A

ALL REPORTED FAULTS, DISPLAYED BY PERCENTAGE OF OCCURRENCE DURING ALL MOT TESTS
PERCENTAGE OF VEHICLE FAULTS WITH BHK 227A
ALL REPORTED FAULTS, DISPLAYED BY PERCENTAGE OF OCCURRENCE DURING ALL MOT TESTS
ADVISORY

FAIL

PASS WITH RECTIFICATION

BHK 227A annual Faults by type

ALL REPORTED FAULTS, DISPLAYED over time and categorised by type
BHK 227A annual Faults by type
ALL REPORTED FAULTS, DISPLAYED over time and categorised by type

ALL BHK 227A ADVISORIES [12]

ALL ADVISORIES, ORDERED by OCCURRENCE DURING BHK 227A's MOT HISTORY
ALL BHK 227A ADVISORIES [12]
ALL ADVISORIES, ORDERED by OCCURRENCE DURING BHK 227A's MOT HISTORY
Advisory Faults | source www.vehiclestats.co.uk
Fault Fault Test Date Test Date/Time Reference MOT Test Reference
2 Parking brake lever has little reserve travel (3.1.6b) Parking brake lever has little reserve travel (3.1.6b) 07 July 2015 [15:01] 07/07/2015 07 July 2015 [15:01] 07/07/2015 349868885164 349868885164 169858985144 169858985144
1 Rear cross member heavily corroded Rear cross member heavily corroded 18 July 2017 [08:17] 18/07/2017 131682307010 131682307010
1 O/s/f brake binding slightly O/s/f brake binding slightly 18 July 2017 [08:17] 18/07/2017 131682307010 131682307010
1 Nearside front upper front suspension has slight movement at a suspension ball joint (2.5.a.1c) Nearside front upper front suspension has slight movement at a suspension ball joint (2.5.a.1c) 19 July 2016 [11:08] 19/07/2016 162330450512 162330450512
1 Offside front suspension arm rubber bush deteriorated but not resulting in excessive movement track control arm bushes (2.4.g.2) Offside front suspension arm rubber bush deteriorated but not resulting in excessive movement track control arm bushes (2.4.g.2) 19 July 2016 [11:08] 19/07/2016 162330450512 162330450512
1 Offside front suspension component mounting prescribed area is corroded but not considered excessive front corner of sub frame by track control arm mount (2.4.a.3) Offside front suspension component mounting prescribed area is corroded but not considered excessive front corner of sub frame by track control arm mount (2.4.a.3) 19 July 2016 [11:08] 19/07/2016 162330450512 162330450512
1 Nearside rear suspension component mounting prescribed area is corroded but not considered excessive sill end/wheel arch near to spring mount (2.4.a.3) Nearside rear suspension component mounting prescribed area is corroded but not considered excessive sill end/wheel arch near to spring mount (2.4.a.3) 19 July 2016 [11:08] 19/07/2016 162330450512 162330450512
1 Nearside steering rack gaiter deteriorated (2.2.d.2d) Nearside steering rack gaiter deteriorated (2.2.d.2d) 02 September 2011 [17:27] 02/09/2011 648315841288 648315841288
1 Offside steering rack gaiter deteriorated (2.2.d.2d) Offside steering rack gaiter deteriorated (2.2.d.2d) 02 September 2011 [17:27] 02/09/2011 648315841288 648315841288
1 Nearside rear suspension spring mounting prescribed area is corroded but not considered excessive (2.4.a.3) Nearside rear suspension spring mounting prescribed area is corroded but not considered excessive (2.4.a.3) 02 September 2011 [17:27] 02/09/2011 648315841288 648315841288
1 Offside rear suspension spring mounting prescribed area is corroded but not considered excessive (2.4.a.3) Offside rear suspension spring mounting prescribed area is corroded but not considered excessive (2.4.a.3) 02 September 2011 [17:27] 02/09/2011 648315841288 648315841288

ALL BHK 227A Failure Faults [12]

ALL Failure faults, ORDERED by OCCURRENCE DURING BHK 227A's MOT HISTORY
ALL BHK 227A Failure Faults [12]
ALL Failure faults, ORDERED by OCCURRENCE DURING BHK 227A's MOT HISTORY
Fail Faults | source www.vehiclestats.co.uk
Fault Fault Test Date Test Date/Time Reference MOT Test Reference
1 Front steering rack gaiter split both (2.2.d.2d) Front steering rack gaiter split both (2.2.d.2d) 18 July 2017 [08:17] 18/07/2017 131682307010 131682307010
1 Offside front suspension component mounting prescribed area is excessively corroded chassis leg (2.4.a.3) Offside front suspension component mounting prescribed area is excessively corroded chassis leg (2.4.a.3) 18 July 2017 [08:17] 18/07/2017 131682307010 131682307010
1 Nearside rear suspension component mounting prescribed area is excessively corroded rear spring mount/chassis leg (2.4.a.3) Nearside rear suspension component mounting prescribed area is excessively corroded rear spring mount/chassis leg (2.4.a.3) 18 July 2017 [08:17] 18/07/2017 131682307010 131682307010
1 Offside rear suspension component mounting prescribed area is excessively corroded rear spring mount/chassis leg (2.4.a.3) Offside rear suspension component mounting prescribed area is excessively corroded rear spring mount/chassis leg (2.4.a.3) 18 July 2017 [08:17] 18/07/2017 131682307010 131682307010
1 Nearside rear suspension component mounting prescribed area is excessively corroded rear inner sill/inner wheel arch (2.4.a.3) Nearside rear suspension component mounting prescribed area is excessively corroded rear inner sill/inner wheel arch (2.4.a.3) 18 July 2017 [08:17] 18/07/2017 131682307010 131682307010
1 Nearside front front wheel bearing rough when rotated (2.5.a.2) Nearside front front wheel bearing rough when rotated (2.5.a.2) 18 July 2017 [08:17] 18/07/2017 131682307010 131682307010
1 Nearside front mechanical brake component has restricted free movement (3.5.1k) Nearside front mechanical brake component has restricted free movement (3.5.1k) 31 July 2009 [18:21] 31/07/2009 663252219259 663252219259
1 Offside front mechanical brake component has restricted free movement (3.5.1k) Offside front mechanical brake component has restricted free movement (3.5.1k) 31 July 2009 [18:21] 31/07/2009 663252219259 663252219259
1 Nearside rear mechanical brake component has restricted free movement (3.5.1k) Nearside rear mechanical brake component has restricted free movement (3.5.1k) 31 July 2009 [18:21] 31/07/2009 663252219259 663252219259
1 Offside rear mechanical brake component has restricted free movement (3.5.1k) Offside rear mechanical brake component has restricted free movement (3.5.1k) 31 July 2009 [18:21] 31/07/2009 663252219259 663252219259
1 Nearside rear shock absorber has a serious fluid leak (2.7.3) Nearside rear shock absorber has a serious fluid leak (2.7.3) 31 July 2009 [18:21] 31/07/2009 663252219259 663252219259
1 Rear registration plate missing (6.3.1a) Rear registration plate missing (6.3.1a) 31 July 2009 [18:21] 31/07/2009 663252219259 663252219259

ALL BHK 227A Pass With Rectification Faults [1]

ALL Pass With Rectification faults, ORDERED by OCCURRENCE DURING BHK 227A's MOT HISTORY
ALL BHK 227A Pass With Rectification Faults [1]
ALL Pass With Rectification faults, ORDERED by OCCURRENCE DURING BHK 227A's MOT HISTORY
Pass With Rectification Faults | source www.vehiclestats.co.uk
Fault Fault Test Date Test Date/Time Reference MOT Test Reference
1 Windscreen washer provides insufficient washer liquid (8.2.3) Windscreen washer provides insufficient washer liquid (8.2.3) 07 July 2015 [15:01] 07/07/2015 169858985144 169858985144

MOT TEST: 18 July 2017 08:17:01 FAILED
MOT TEST: 18 July 2017 08:17:01 FAILED

This test (131682307010) was completed on the 18 July 2017 08:17:01 and FAILED the requirements for a valid MOT with 8 comments.

This test (131682307010) was completed on the 18 July 2017 08:17:01 and FAILED the requirements for a valid MOT with 8 comments.

Recorded mileage: 76,367

Recorded mileage: 76,367


ADVISORY

FAIL


MOT TEST: 19 July 2016 11:08:27 PASSED
MOT TEST: 19 July 2016 11:08:27 PASSED

This test (162330450512) was completed on the 19 July 2016 11:08:27 and PASSED the requirements for a valid MOT with 4 comments.

This test (162330450512) was completed on the 19 July 2016 11:08:27 and PASSED the requirements for a valid MOT with 4 comments.

Recorded mileage: 76,347

Recorded mileage: 76,347


ADVISORY


MOT TEST: 07 July 2015 15:01:09 PASSED
MOT TEST: 07 July 2015 15:01:09 PASSED

This test (349868885164) was completed on the 07 July 2015 15:01:09 and PASSED the requirements for a valid MOT with 1 comments.

This test (349868885164) was completed on the 07 July 2015 15:01:09 and PASSED the requirements for a valid MOT with 1 comments.

Recorded mileage: 76,169

Recorded mileage: 76,169


ADVISORY


MOT TEST: 07 July 2015 15:01:09 FAILED
MOT TEST: 07 July 2015 15:01:09 FAILED

This test (169858985144) was completed on the 07 July 2015 15:01:09 and FAILED the requirements for a valid MOT with 2 comments.

This test (169858985144) was completed on the 07 July 2015 15:01:09 and FAILED the requirements for a valid MOT with 2 comments.

Recorded mileage: 76,169

Recorded mileage: 76,169


ADVISORY

PASS WITH RECTIFICATION


MOT TEST: 03 July 2014 14:42:59 PASSED
MOT TEST: 03 July 2014 14:42:59 PASSED

This test (287894784449) was completed on the 03 July 2014 14:42:59 and PASSED the requirements for a valid MOT with 0 comments.

This test (287894784449) was completed on the 03 July 2014 14:42:59 and PASSED the requirements for a valid MOT with 0 comments.

Recorded mileage: 76,059

Recorded mileage: 76,059


MOT TEST: 22 July 2013 15:35:14 PASSED
MOT TEST: 22 July 2013 15:35:14 PASSED

This test (279343003252) was completed on the 22 July 2013 15:35:14 and PASSED the requirements for a valid MOT with 0 comments.

This test (279343003252) was completed on the 22 July 2013 15:35:14 and PASSED the requirements for a valid MOT with 0 comments.

Recorded mileage: 75,943

Recorded mileage: 75,943


MOT TEST: 02 September 2011 17:27:21 PASSED
MOT TEST: 02 September 2011 17:27:21 PASSED

This test (648315841288) was completed on the 02 September 2011 17:27:21 and PASSED the requirements for a valid MOT with 4 comments.

This test (648315841288) was completed on the 02 September 2011 17:27:21 and PASSED the requirements for a valid MOT with 4 comments.

Recorded mileage: 75,744

Recorded mileage: 75,744


ADVISORY


MOT TEST: 21 August 2010 09:16:15 PASSED
MOT TEST: 21 August 2010 09:16:15 PASSED

This test (632753130271) was completed on the 21 August 2010 09:16:15 and PASSED the requirements for a valid MOT with 0 comments.

This test (632753130271) was completed on the 21 August 2010 09:16:15 and PASSED the requirements for a valid MOT with 0 comments.

Recorded mileage: 75,274

Recorded mileage: 75,274


MOT TEST: 03 August 2009 17:06:58 PASSED
MOT TEST: 03 August 2009 17:06:58 PASSED

This test (484155619201) was completed on the 03 August 2009 17:06:58 and PASSED the requirements for a valid MOT with 0 comments.

This test (484155619201) was completed on the 03 August 2009 17:06:58 and PASSED the requirements for a valid MOT with 0 comments.

Recorded mileage: 75,233

Recorded mileage: 75,233


MOT TEST: 31 July 2009 18:21:31 FAILED
MOT TEST: 31 July 2009 18:21:31 FAILED

This test (663252219259) was completed on the 31 July 2009 18:21:31 and FAILED the requirements for a valid MOT with 6 comments.

This test (663252219259) was completed on the 31 July 2009 18:21:31 and FAILED the requirements for a valid MOT with 6 comments.

Recorded mileage: 75,223

Recorded mileage: 75,223


FAIL