BHW 445A


BHW445A is registered to a Blue 1963, Morris Mini cooper with a Petrol engine. It Failed its most recent MOT Test on the 18 October 2017

5 unique faults (6 Total) reported in its MOT History (6 Tests).

1 common/recurring faults.

83% (5) MOT Pass Rate and a 17% (1) MOT Failure Rate.

49,613 recorded miles.

BHW 445A


BHW445A is registered to a Blue 1963, Morris Mini cooper with a Petrol engine. It Failed its most recent MOT Test on the 18 October 2017

5 unique faults (6 Total) reported in its MOT History (6 Tests).

1 common/recurring faults.

83% (5) MOT Pass Rate and a 17% (1) MOT Failure Rate.

49,613 recorded miles.

MOT PASS/Failure rate for BHW 445A

all MOT test results for BHW 445A represented as a percentage
MOT PASS/Failure rate for BHW 445A
all MOT test results for BHW 445A represented as a percentage

PERCENTAGE OF VEHICLE FAULTS WITH BHW 445A

ALL REPORTED FAULTS, DISPLAYED BY PERCENTAGE OF OCCURRENCE DURING ALL MOT TESTS
PERCENTAGE OF VEHICLE FAULTS WITH BHW 445A
ALL REPORTED FAULTS, DISPLAYED BY PERCENTAGE OF OCCURRENCE DURING ALL MOT TESTS
ADVISORY

FAIL

BHW 445A annual Faults by type

ALL REPORTED FAULTS, DISPLAYED over time and categorised by type
BHW 445A annual Faults by type
ALL REPORTED FAULTS, DISPLAYED over time and categorised by type

ALL BHW 445A ADVISORIES [2]

ALL ADVISORIES, ORDERED by OCCURRENCE DURING BHW 445A's MOT HISTORY
ALL BHW 445A ADVISORIES [2]
ALL ADVISORIES, ORDERED by OCCURRENCE DURING BHW 445A's MOT HISTORY
Advisory Faults | source www.vehiclestats.co.uk
Fault Fault Test Date Test Date/Time Reference MOT Test Reference
2 Play in nearside of steering rack Play in nearside of steering rack 23 July 2016 [08:43] 23/07/2016 22 July 2016 [08:09] 22/07/2016 556612259649 556612259649 276025436452 276025436452

ALL BHW 445A Failure Faults [4]

ALL Failure faults, ORDERED by OCCURRENCE DURING BHW 445A's MOT HISTORY
ALL BHW 445A Failure Faults [4]
ALL Failure faults, ORDERED by OCCURRENCE DURING BHW 445A's MOT HISTORY
Fail Faults | source www.vehiclestats.co.uk
Fault Fault Test Date Test Date/Time Reference MOT Test Reference
1 Offside rear brake recording little or no effort (3.7.b.5a) Offside rear brake recording little or no effort (3.7.b.5a) 22 July 2016 [08:09] 22/07/2016 276025436452 276025436452
1 Offside front position lamp(s) not working (1.1.a.3b) Offside front position lamp(s) not working (1.1.a.3b) 22 July 2016 [08:09] 22/07/2016 276025436452 276025436452
1 Service brake: efficiency below requirements (3.7.b.7) Service brake: efficiency below requirements (3.7.b.7) 22 July 2016 [08:09] 22/07/2016 276025436452 276025436452
1 Rear brakes imbalanced across an axle axle 2 (3.7.b.5b) Rear brakes imbalanced across an axle axle 2 (3.7.b.5b) 22 July 2016 [08:09] 22/07/2016 276025436452 276025436452

MOT TEST: 18 October 2017 10:20:13 PASSED
MOT TEST: 18 October 2017 10:20:13 PASSED

This test (360465447289) was completed on the 18 October 2017 10:20:13 and PASSED the requirements for a valid MOT with 0 comments.

This test (360465447289) was completed on the 18 October 2017 10:20:13 and PASSED the requirements for a valid MOT with 0 comments.

Recorded mileage: 49,613

Recorded mileage: 49,613


MOT TEST: 23 July 2016 08:43:48 PASSED
MOT TEST: 23 July 2016 08:43:48 PASSED

This test (556612259649) was completed on the 23 July 2016 08:43:48 and PASSED the requirements for a valid MOT with 1 comments.

This test (556612259649) was completed on the 23 July 2016 08:43:48 and PASSED the requirements for a valid MOT with 1 comments.

Recorded mileage: 45,481

Recorded mileage: 45,481


ADVISORY


MOT TEST: 22 July 2016 08:09:23 FAILED
MOT TEST: 22 July 2016 08:09:23 FAILED

This test (276025436452) was completed on the 22 July 2016 08:09:23 and FAILED the requirements for a valid MOT with 5 comments.

This test (276025436452) was completed on the 22 July 2016 08:09:23 and FAILED the requirements for a valid MOT with 5 comments.

Recorded mileage: 45,473

Recorded mileage: 45,473


ADVISORY

FAIL


MOT TEST: 14 July 2015 12:23:43 PASSED
MOT TEST: 14 July 2015 12:23:43 PASSED

This test (416615695166) was completed on the 14 July 2015 12:23:43 and PASSED the requirements for a valid MOT with 0 comments.

This test (416615695166) was completed on the 14 July 2015 12:23:43 and PASSED the requirements for a valid MOT with 0 comments.

Recorded mileage: 48,693

Recorded mileage: 48,693


MOT TEST: 18 July 2014 15:38:20 PASSED
MOT TEST: 18 July 2014 15:38:20 PASSED

This test (636839594133) was completed on the 18 July 2014 15:38:20 and PASSED the requirements for a valid MOT with 0 comments.

This test (636839594133) was completed on the 18 July 2014 15:38:20 and PASSED the requirements for a valid MOT with 0 comments.

Recorded mileage: 48,524

Recorded mileage: 48,524


MOT TEST: 30 August 2006 10:10:20 PASSED
MOT TEST: 30 August 2006 10:10:20 PASSED

This test (523732746250) was completed on the 30 August 2006 10:10:20 and PASSED the requirements for a valid MOT with 0 comments.

This test (523732746250) was completed on the 30 August 2006 10:10:20 and PASSED the requirements for a valid MOT with 0 comments.

Recorded mileage: 48,502

Recorded mileage: 48,502