BOO 712F


BOO712F is registered to a Grey 1968, Morris Minor 1000 with a Petrol engine. It Failed its most recent MOT Test on the 23 May 2017

10 unique faults (10 Total) reported in its MOT History (10 Tests).

0 common/recurring faults.

80% (8) MOT Pass Rate and a 20% (2) MOT Failure Rate.

90,730 recorded miles.

BOO 712F


BOO712F is registered to a Grey 1968, Morris Minor 1000 with a Petrol engine. It Failed its most recent MOT Test on the 23 May 2017

10 unique faults (10 Total) reported in its MOT History (10 Tests).

0 common/recurring faults.

80% (8) MOT Pass Rate and a 20% (2) MOT Failure Rate.

90,730 recorded miles.

MOT PASS/Failure rate for BOO 712F

all MOT test results for BOO 712F represented as a percentage
MOT PASS/Failure rate for BOO 712F
all MOT test results for BOO 712F represented as a percentage

PERCENTAGE OF VEHICLE FAULTS WITH BOO 712F

ALL REPORTED FAULTS, DISPLAYED BY PERCENTAGE OF OCCURRENCE DURING ALL MOT TESTS
PERCENTAGE OF VEHICLE FAULTS WITH BOO 712F
ALL REPORTED FAULTS, DISPLAYED BY PERCENTAGE OF OCCURRENCE DURING ALL MOT TESTS
FAIL

USER ENTERED

PASS WITH RECTIFICATION

BOO 712F annual Faults by type

ALL REPORTED FAULTS, DISPLAYED over time and categorised by type
BOO 712F annual Faults by type
ALL REPORTED FAULTS, DISPLAYED over time and categorised by type

ALL BOO 712F Failure Faults [5]

ALL Failure faults, ORDERED by OCCURRENCE DURING BOO 712F's MOT HISTORY
ALL BOO 712F Failure Faults [5]
ALL Failure faults, ORDERED by OCCURRENCE DURING BOO 712F's MOT HISTORY
Fail Faults | source www.vehiclestats.co.uk
Fault Fault Test Date Test Date/Time Reference MOT Test Reference
1 Front windscreen wiper blade missing (8.2.2) Front windscreen wiper blade missing (8.2.2) 26 August 2009 [09:31] 26/08/2009 453658839225 453658839225
1 Offside indicator switch faulty (1.4.a.1) Offside indicator switch faulty (1.4.a.1) 26 August 2009 [09:31] 26/08/2009 453658839225 453658839225
1 Rear stop lamp not working (1.2.1b) Rear stop lamp not working (1.2.1b) 26 August 2009 [09:31] 26/08/2009 453658839225 453658839225
1 Brake pedal spongy (3.3.b.1b) Brake pedal spongy (3.3.b.1b) 26 August 2009 [09:31] 26/08/2009 453658839225 453658839225
1 Brake pedal creeps down when held under pressure (3.3.b.1a) Brake pedal creeps down when held under pressure (3.3.b.1a) 26 August 2009 [09:31] 26/08/2009 453658839225 453658839225

ALL BOO 712F User Entered Faults [1]

ALL User Entered faults, ORDERED by OCCURRENCE DURING BOO 712F's MOT HISTORY
ALL BOO 712F User Entered Faults [1]
ALL User Entered faults, ORDERED by OCCURRENCE DURING BOO 712F's MOT HISTORY
User Entered Faults | source www.vehiclestats.co.uk
Fault Fault Test Date Test Date/Time Reference MOT Test Reference
1 Offside and nearside rear seat belts not fitted to the requirerd standard . Offside and nearside rear seat belts not fitted to the requirerd standard . 02 October 2012 [09:40] 02/10/2012 157866472291 157866472291

ALL BOO 712F Pass With Rectification Faults [4]

ALL Pass With Rectification faults, ORDERED by OCCURRENCE DURING BOO 712F's MOT HISTORY
ALL BOO 712F Pass With Rectification Faults [4]
ALL Pass With Rectification faults, ORDERED by OCCURRENCE DURING BOO 712F's MOT HISTORY
Pass With Rectification Faults | source www.vehiclestats.co.uk
Fault Fault Test Date Test Date/Time Reference MOT Test Reference
1 Offside rear stop lamp adversely affected by the operation of another lamp (1.2.1f) Offside rear stop lamp adversely affected by the operation of another lamp (1.2.1f) 09 August 2010 [09:03] 09/08/2010 394101820426 394101820426
1 Offside rear stop lamp remains on when the brakes are released (1.2.1e) Offside rear stop lamp remains on when the brakes are released (1.2.1e) 09 August 2010 [09:03] 09/08/2010 394101820426 394101820426
1 Nearside front headlamp aim too low (1.8) Nearside front headlamp aim too low (1.8) 26 August 2009 [09:31] 26/08/2009 453658839225 453658839225
1 Offside headlamp aim too low (1.8) Offside headlamp aim too low (1.8) 26 August 2009 [09:31] 26/08/2009 453658839225 453658839225

MOT TEST: 23 May 2017 08:11:23 PASSED
MOT TEST: 23 May 2017 08:11:23 PASSED

This test (371844839388) was completed on the 23 May 2017 08:11:23 and PASSED the requirements for a valid MOT with 0 comments.

This test (371844839388) was completed on the 23 May 2017 08:11:23 and PASSED the requirements for a valid MOT with 0 comments.

Recorded mileage: 90,730

Recorded mileage: 90,730


MOT TEST: 29 February 2016 14:27:51 PASSED
MOT TEST: 29 February 2016 14:27:51 PASSED

This test (535616403872) was completed on the 29 February 2016 14:27:51 and PASSED the requirements for a valid MOT with 0 comments.

This test (535616403872) was completed on the 29 February 2016 14:27:51 and PASSED the requirements for a valid MOT with 0 comments.

Recorded mileage: 76,927

Recorded mileage: 76,927


MOT TEST: 17 February 2015 10:43:00 PASSED
MOT TEST: 17 February 2015 10:43:00 PASSED

This test (777918445022) was completed on the 17 February 2015 10:43:00 and PASSED the requirements for a valid MOT with 0 comments.

This test (777918445022) was completed on the 17 February 2015 10:43:00 and PASSED the requirements for a valid MOT with 0 comments.

Recorded mileage: 6,606

Recorded mileage: 6,606


MOT TEST: 23 October 2013 10:44:31 PASSED
MOT TEST: 23 October 2013 10:44:31 PASSED

This test (796716593225) was completed on the 23 October 2013 10:44:31 and PASSED the requirements for a valid MOT with 0 comments.

This test (796716593225) was completed on the 23 October 2013 10:44:31 and PASSED the requirements for a valid MOT with 0 comments.

Recorded mileage: 6,187

Recorded mileage: 6,187


MOT TEST: 02 October 2012 09:40:35 PASSED
MOT TEST: 02 October 2012 09:40:35 PASSED

This test (157866472291) was completed on the 02 October 2012 09:40:35 and PASSED the requirements for a valid MOT with 1 comments.

This test (157866472291) was completed on the 02 October 2012 09:40:35 and PASSED the requirements for a valid MOT with 1 comments.

Recorded mileage: 4,563

Recorded mileage: 4,563


USER ENTERED


MOT TEST: 25 August 2011 09:19:50 PASSED
MOT TEST: 25 August 2011 09:19:50 PASSED

This test (248667431274) was completed on the 25 August 2011 09:19:50 and PASSED the requirements for a valid MOT with 0 comments.

This test (248667431274) was completed on the 25 August 2011 09:19:50 and PASSED the requirements for a valid MOT with 0 comments.

Recorded mileage: 3,399

Recorded mileage: 3,399


MOT TEST: 09 August 2010 09:03:08 PASSED
MOT TEST: 09 August 2010 09:03:08 PASSED

This test (644971620247) was completed on the 09 August 2010 09:03:08 and PASSED the requirements for a valid MOT with 0 comments.

This test (644971620247) was completed on the 09 August 2010 09:03:08 and PASSED the requirements for a valid MOT with 0 comments.

Recorded mileage: 2,613

Recorded mileage: 2,613


MOT TEST: 09 August 2010 09:03:08 FAILED
MOT TEST: 09 August 2010 09:03:08 FAILED

This test (394101820426) was completed on the 09 August 2010 09:03:08 and FAILED the requirements for a valid MOT with 2 comments.

This test (394101820426) was completed on the 09 August 2010 09:03:08 and FAILED the requirements for a valid MOT with 2 comments.

Recorded mileage: 2,613

Recorded mileage: 2,613


PASS WITH RECTIFICATION


MOT TEST: 27 August 2009 11:07:44 PASSED
MOT TEST: 27 August 2009 11:07:44 PASSED

This test (381619739450) was completed on the 27 August 2009 11:07:44 and PASSED the requirements for a valid MOT with 0 comments.

This test (381619739450) was completed on the 27 August 2009 11:07:44 and PASSED the requirements for a valid MOT with 0 comments.

Recorded mileage: 2,176

Recorded mileage: 2,176


MOT TEST: 26 August 2009 09:31:21 FAILED
MOT TEST: 26 August 2009 09:31:21 FAILED

This test (453658839225) was completed on the 26 August 2009 09:31:21 and FAILED the requirements for a valid MOT with 7 comments.

This test (453658839225) was completed on the 26 August 2009 09:31:21 and FAILED the requirements for a valid MOT with 7 comments.

Recorded mileage: 2,176

Recorded mileage: 2,176


FAIL

PASS WITH RECTIFICATION