BOV 578C


BOV578C is registered to a Grey 1964, Morris Minor with a Petrol engine. It Failed its most recent MOT Test on the 16 September 2016

63 unique faults (67 Total) reported in its MOT History (9 Tests).

3 common/recurring faults, the most frequent (2 times) is: Offside Front Lower Suspension arm rubber bush deteriorated but not resulting in excessive movement (2.4.G.2).

67% (6) MOT Pass Rate and a 33% (3) MOT Failure Rate.

34,840 recorded miles.

BOV 578C


BOV578C is registered to a Grey 1964, Morris Minor with a Petrol engine. It Failed its most recent MOT Test on the 16 September 2016

63 unique faults (67 Total) reported in its MOT History (9 Tests).

3 common/recurring faults, the most frequent (2 times) is: Offside Front Lower Suspension arm rubber bush deteriorated but not resulting in excessive movement (2.4.G.2).

67% (6) MOT Pass Rate and a 33% (3) MOT Failure Rate.

34,840 recorded miles.

MOT PASS/Failure rate for BOV 578C

all MOT test results for BOV 578C represented as a percentage
MOT PASS/Failure rate for BOV 578C
all MOT test results for BOV 578C represented as a percentage

PERCENTAGE OF VEHICLE FAULTS WITH BOV 578C

ALL REPORTED FAULTS, DISPLAYED BY PERCENTAGE OF OCCURRENCE DURING ALL MOT TESTS
PERCENTAGE OF VEHICLE FAULTS WITH BOV 578C
ALL REPORTED FAULTS, DISPLAYED BY PERCENTAGE OF OCCURRENCE DURING ALL MOT TESTS
ADVISORY

FAIL

USER ENTERED

BOV 578C annual Faults by type

ALL REPORTED FAULTS, DISPLAYED over time and categorised by type
BOV 578C annual Faults by type
ALL REPORTED FAULTS, DISPLAYED over time and categorised by type

RECURRING FAULTS WITH BOV 578C

FAULTS THAT HAVE OCCURED MORE THAN ONCE DURING BOV 578C's MOT HISTORY
RECURRING FAULTS WITH BOV 578C
FAULTS THAT HAVE OCCURED MORE THAN ONCE DURING BOV 578C's MOT HISTORY
Fault Fault Test Date Test Date/Time Reference MOT Test Reference
2 Offside front lower suspension arm rubber bush deteriorated but not resulting in excessive movement (2.4.g.2) Offside front lower suspension arm rubber bush deteriorated but not resulting in excessive movement (2.4.g.2) 16 September 2016 [14:22] 16/09/2016 09 June 2014 [14:45] 09/06/2014 472119149044 472119149044 168940364111 168940364111
2 Parking brake: efficiency below requirements (3.7.b.7) Parking brake: efficiency below requirements (3.7.b.7) 16 August 2016 [14:56] 16/08/2016 09 June 2014 [14:45] 09/06/2014 722226335905 722226335905 168940364111 168940364111
2 Exhaust has a minor leak of exhaust gases (7.1.2) Exhaust has a minor leak of exhaust gases (7.1.2) 03 July 2014 [10:31] 03/07/2014 09 June 2014 [14:45] 09/06/2014 455134084174 455134084174 168940364111 168940364111

ALL BOV 578C ADVISORIES [17]

ALL ADVISORIES, ORDERED by OCCURRENCE DURING BOV 578C's MOT HISTORY
ALL BOV 578C ADVISORIES [17]
ALL ADVISORIES, ORDERED by OCCURRENCE DURING BOV 578C's MOT HISTORY
Advisory Faults | source www.vehiclestats.co.uk
Fault Fault Test Date Test Date/Time Reference MOT Test Reference
2 Offside front lower suspension arm rubber bush deteriorated but not resulting in excessive movement (2.4.g.2) Offside front lower suspension arm rubber bush deteriorated but not resulting in excessive movement (2.4.g.2) 16 September 2016 [14:22] 16/09/2016 09 June 2014 [14:45] 09/06/2014 472119149044 472119149044 168940364111 168940364111
2 Exhaust has a minor leak of exhaust gases (7.1.2) Exhaust has a minor leak of exhaust gases (7.1.2) 03 July 2014 [10:31] 03/07/2014 09 June 2014 [14:45] 09/06/2014 455134084174 455134084174 168940364111 168940364111
1 Nearside rear leaf spring has a slightly deteriorated anchor pin rubber bush not resulting in excessive movement (2.4.b.2) Nearside rear leaf spring has a slightly deteriorated anchor pin rubber bush not resulting in excessive movement (2.4.b.2) 16 September 2016 [14:22] 16/09/2016 472119149044 472119149044
1 Offside rear leaf spring has a slightly deteriorated anchor pin rubber bush not resulting in excessive movement (2.4.b.2) Offside rear leaf spring has a slightly deteriorated anchor pin rubber bush not resulting in excessive movement (2.4.b.2) 16 September 2016 [14:22] 16/09/2016 472119149044 472119149044
1 Nearside rear leaf spring has a slightly deteriorated shackle pin rubber bush not resulting in excessive movement (2.4.b.2) Nearside rear leaf spring has a slightly deteriorated shackle pin rubber bush not resulting in excessive movement (2.4.b.2) 16 September 2016 [14:22] 16/09/2016 472119149044 472119149044
1 Offside rear leaf spring has a slightly deteriorated shackle pin rubber bush not resulting in excessive movement (2.4.b.2) Offside rear leaf spring has a slightly deteriorated shackle pin rubber bush not resulting in excessive movement (2.4.b.2) 16 September 2016 [14:22] 16/09/2016 472119149044 472119149044
1 Nearside front lower suspension arm rubber bush deteriorated but not resulting in excessive movement (2.4.g.2) Nearside front lower suspension arm rubber bush deteriorated but not resulting in excessive movement (2.4.g.2) 16 September 2016 [14:22] 16/09/2016 472119149044 472119149044
1 Cannot carry out a thorough inspection of body due to excessively applied sealer & black paint Cannot carry out a thorough inspection of body due to excessively applied sealer & black paint 16 September 2016 [14:22] 16/09/2016 472119149044 472119149044
1 Rear leaf springs worn Rear leaf springs worn 16 September 2016 [14:22] 16/09/2016 472119149044 472119149044
1 A lot of previous welding only just acceptible A lot of previous welding only just acceptible 16 September 2016 [14:22] 16/09/2016 472119149044 472119149044
1 Front brakes imbalanced requirements only just met. It would appear that the braking system requires adjustment or repair. (3.7.b.5b) Front brakes imbalanced requirements only just met. It would appear that the braking system requires adjustment or repair. (3.7.b.5b) 16 September 2016 [14:22] 16/09/2016 472119149044 472119149044
1 Rear brakes imbalanced requirements only just met. It would appear that the braking system requires adjustment or repair. (3.7.b.5b) Rear brakes imbalanced requirements only just met. It would appear that the braking system requires adjustment or repair. (3.7.b.5b) 16 September 2016 [14:22] 16/09/2016 472119149044 472119149044
1 The chassis/main load bearing members/sections have had excessive underseal applied. The chassis/main load bearing members/sections have had excessive underseal applied. 16 August 2016 [14:56] 16/08/2016 722226335905 722226335905
1 Offside rear tyre worn close to the legal limit (4.1.e.1) Offside rear tyre worn close to the legal limit (4.1.e.1) 03 July 2014 [10:31] 03/07/2014 455134084174 455134084174
1 Steering column top bearing slightly worn (2.1.2c) Steering column top bearing slightly worn (2.1.2c) 09 June 2014 [14:45] 09/06/2014 168940364111 168940364111

ALL BOV 578C Failure Faults [34]

ALL Failure faults, ORDERED by OCCURRENCE DURING BOV 578C's MOT HISTORY
ALL BOV 578C Failure Faults [34]
ALL Failure faults, ORDERED by OCCURRENCE DURING BOV 578C's MOT HISTORY
Fail Faults | source www.vehiclestats.co.uk
Fault Fault Test Date Test Date/Time Reference MOT Test Reference
2 Parking brake: efficiency below requirements (3.7.b.7) Parking brake: efficiency below requirements (3.7.b.7) 16 August 2016 [14:56] 16/08/2016 09 June 2014 [14:45] 09/06/2014 722226335905 722226335905 168940364111 168940364111
1 Rear brakes imbalanced across an axle axle 2 (3.7.b.5b) Rear brakes imbalanced across an axle axle 2 (3.7.b.5b) 16 August 2016 [14:56] 16/08/2016 722226335905 722226335905
1 Nearside front position lamp(s) not working (1.1.a.3b) Nearside front position lamp(s) not working (1.1.a.3b) 16 August 2016 [14:56] 16/08/2016 722226335905 722226335905
1 Horn not working (1.6.2a) Horn not working (1.6.2a) 16 August 2016 [14:56] 16/08/2016 722226335905 722226335905
1 Nearside rear braking system leaking possibly gear oil from hub bearing (3.6.a.1) Nearside rear braking system leaking possibly gear oil from hub bearing (3.6.a.1) 16 August 2016 [14:56] 16/08/2016 722226335905 722226335905
1 Offside rear braking system leaking possibly gear oil from hub bearing (3.6.a.1) Offside rear braking system leaking possibly gear oil from hub bearing (3.6.a.1) 16 August 2016 [14:56] 16/08/2016 722226335905 722226335905
1 Nearside front brake pipe inadequately supported steel to flexible brake house union mounting bracket broken. (3.6.b.1) Nearside front brake pipe inadequately supported steel to flexible brake house union mounting bracket broken. (3.6.b.1) 16 August 2016 [14:56] 16/08/2016 722226335905 722226335905
1 Nearside steering rack gaiter split (2.2.d.2d) Nearside steering rack gaiter split (2.2.d.2d) 16 August 2016 [14:56] 16/08/2016 722226335905 722226335905
1 Offside steering rack gaiter split (2.2.d.2d) Offside steering rack gaiter split (2.2.d.2d) 16 August 2016 [14:56] 16/08/2016 722226335905 722226335905
1 Nearside rear suspension spring mounting prescribed area is excessively corroded chassis by shackle pin bracket. (2.4.a.3) Nearside rear suspension spring mounting prescribed area is excessively corroded chassis by shackle pin bracket. (2.4.a.3) 16 August 2016 [14:56] 16/08/2016 722226335905 722226335905
1 Nearside rear suspension spring mounting prescribed area is excessively corroded (2.4.a.3) Nearside rear suspension spring mounting prescribed area is excessively corroded (2.4.a.3) 03 July 2014 [10:31] 03/07/2014 455134084174 455134084174
1 Front suspension spring mounting prescribed area is excessively corroded (2.4.a.3) Front suspension spring mounting prescribed area is excessively corroded (2.4.a.3) 03 July 2014 [10:31] 03/07/2014 455134084174 455134084174
1 Nearside inner front lower suspension arm rubber bush deteriorated resulting in excessive movement (2.4.g.2) Nearside inner front lower suspension arm rubber bush deteriorated resulting in excessive movement (2.4.g.2) 03 July 2014 [10:31] 03/07/2014 455134084174 455134084174
1 Offside inner front lower suspension arm rubber bush deteriorated resulting in excessive movement (2.4.g.2) Offside inner front lower suspension arm rubber bush deteriorated resulting in excessive movement (2.4.g.2) 03 July 2014 [10:31] 03/07/2014 455134084174 455134084174
1 Fuel cap/sealing device sealing washer missing (7.2.4c) Fuel cap/sealing device sealing washer missing (7.2.4c) 09 June 2014 [14:45] 09/06/2014 168940364111 168940364111
1 Nearside front suspension arm rubber bush deteriorated resulting in excessive movement (2.4.g.2) Nearside front suspension arm rubber bush deteriorated resulting in excessive movement (2.4.g.2) 09 June 2014 [14:45] 09/06/2014 168940364111 168940364111
1 Nearside front upper suspension component mounting prescribed area is inadequately repaired (2.4.a.3) Nearside front upper suspension component mounting prescribed area is inadequately repaired (2.4.a.3) 09 June 2014 [14:45] 09/06/2014 168940364111 168940364111
1 Offside front upper suspension component mounting prescribed area is inadequately repaired (2.4.a.3) Offside front upper suspension component mounting prescribed area is inadequately repaired (2.4.a.3) 09 June 2014 [14:45] 09/06/2014 168940364111 168940364111
1 Nearside front lower tie bar/rod has excessive play in a pin/bush (2.4.g.2) Nearside front lower tie bar/rod has excessive play in a pin/bush (2.4.g.2) 09 June 2014 [14:45] 09/06/2014 168940364111 168940364111
1 Offside front lower tie bar/rod has excessive play in a pin/bush (2.4.g.2) Offside front lower tie bar/rod has excessive play in a pin/bush (2.4.g.2) 09 June 2014 [14:45] 09/06/2014 168940364111 168940364111
1 Offside rear tyre tread depth below requirements of 1.6mm (4.1.e.1) Offside rear tyre tread depth below requirements of 1.6mm (4.1.e.1) 09 June 2014 [14:45] 09/06/2014 168940364111 168940364111
1 Front electrical wiring deteriorated, likely to cause a short (1.9.2b) Front electrical wiring deteriorated, likely to cause a short (1.9.2b) 09 June 2014 [14:45] 09/06/2014 168940364111 168940364111
1 Nearside front suspension component mounting prescribed area is excessively corroded (2.4.a.3) Nearside front suspension component mounting prescribed area is excessively corroded (2.4.a.3) 09 June 2014 [14:45] 09/06/2014 168940364111 168940364111
1 Nearside front suspension component mounting prescribed area is fractured (2.4.a.3) Nearside front suspension component mounting prescribed area is fractured (2.4.a.3) 09 June 2014 [14:45] 09/06/2014 168940364111 168940364111
1 Nearside front suspension component mounting prescribed area is inadequately repaired (2.4.a.3) Nearside front suspension component mounting prescribed area is inadequately repaired (2.4.a.3) 09 June 2014 [14:45] 09/06/2014 168940364111 168940364111
1 Nearside rear suspension component mounting prescribed area is excessively corroded (2.4.a.3) Nearside rear suspension component mounting prescribed area is excessively corroded (2.4.a.3) 09 June 2014 [14:45] 09/06/2014 168940364111 168940364111
1 Offside rear suspension component mounting prescribed area is excessively corroded (2.4.a.3) Offside rear suspension component mounting prescribed area is excessively corroded (2.4.a.3) 09 June 2014 [14:45] 09/06/2014 168940364111 168940364111
1 Nearside body or chassis has an inadequate repair, seriously affecting its strength within 30cm of the body mountings (6.1.b.2) Nearside body or chassis has an inadequate repair, seriously affecting its strength within 30cm of the body mountings (6.1.b.2) 09 June 2014 [14:45] 09/06/2014 168940364111 168940364111
1 Nearside body or chassis is cracked, seriously affecting its strength within 30cm of the body mountings (6.1.b.2) Nearside body or chassis is cracked, seriously affecting its strength within 30cm of the body mountings (6.1.b.2) 09 June 2014 [14:45] 09/06/2014 168940364111 168940364111
1 Offside seat belt anchorage prescribed area is fractured (5.2.6) Offside seat belt anchorage prescribed area is fractured (5.2.6) 09 June 2014 [14:45] 09/06/2014 168940364111 168940364111
1 Service brake: efficiency below requirements (3.7.b.7) Service brake: efficiency below requirements (3.7.b.7) 09 June 2014 [14:45] 09/06/2014 168940364111 168940364111
1 Brakes imbalanced across an axle (3.7.b.5b) Brakes imbalanced across an axle (3.7.b.5b) 09 June 2014 [14:45] 09/06/2014 168940364111 168940364111

ALL BOV 578C User Entered Faults [16]

ALL User Entered faults, ORDERED by OCCURRENCE DURING BOV 578C's MOT HISTORY
ALL BOV 578C User Entered Faults [16]
ALL User Entered faults, ORDERED by OCCURRENCE DURING BOV 578C's MOT HISTORY
User Entered Faults | source www.vehiclestats.co.uk
Fault Fault Test Date Test Date/Time Reference MOT Test Reference
1 Previous welding done before mot Previous welding done before mot 07 August 2015 [15:59] 07/08/2015 288959515200 288959515200
1 Heavily undersealed Heavily undersealed 07 August 2015 [15:59] 07/08/2015 288959515200 288959515200
1 N/s/f floor pan has corrosion N/s/f floor pan has corrosion 01 August 2014 [08:36] 01/08/2014 127943914231 127943914231
1 Chassis slightly corroded Chassis slightly corroded 01 August 2014 [08:36] 01/08/2014 127943914231 127943914231
1 Rear diff has a slight leak Rear diff has a slight leak 01 August 2014 [08:36] 01/08/2014 127943914231 127943914231
1 Underside has evidence of fibreglass matting applied with thick underseal covering Underside has evidence of fibreglass matting applied with thick underseal covering 01 August 2014 [08:36] 01/08/2014 127943914231 127943914231
1 Underside has evidence of fibreglass matting applied with thick underseal covering. Underside has evidence of fibreglass matting applied with thick underseal covering. 03 July 2014 [10:31] 03/07/2014 455134084174 455134084174
1 Indicator warning lamp on stalk inoperative but warning light on speedo face working Indicator warning lamp on stalk inoperative but warning light on speedo face working 09 June 2014 [14:45] 09/06/2014 168940364111 168940364111
1 Floor below drivers seat flexing considerable and around seat hinges Floor below drivers seat flexing considerable and around seat hinges 09 June 2014 [14:45] 09/06/2014 168940364111 168940364111
1 Nearside front and rear seat belts removed Nearside front and rear seat belts removed 09 June 2014 [14:45] 09/06/2014 168940364111 168940364111
1 Front number plate bracket cracked and corroding away Front number plate bracket cracked and corroding away 09 June 2014 [14:45] 09/06/2014 168940364111 168940364111
1 Front bumper and wing and front panel slightly loose Front bumper and wing and front panel slightly loose 09 June 2014 [14:45] 09/06/2014 168940364111 168940364111
1 Unable to assess all repairs already carried out on vehicle due to liberal applications of body sealer , undersealant , dum dum and filler in many areas Unable to assess all repairs already carried out on vehicle due to liberal applications of body sealer , undersealant , dum dum and filler in many areas 09 June 2014 [14:45] 09/06/2014 168940364111 168940364111
1 Nearside rear tyre perished Nearside rear tyre perished 09 June 2014 [14:45] 09/06/2014 168940364111 168940364111
1 Wiring in engine bay loose but not likely to cause a short and recommend to affix properly and more securely than current arrangements Wiring in engine bay loose but not likely to cause a short and recommend to affix properly and more securely than current arrangements 09 June 2014 [14:45] 09/06/2014 168940364111 168940364111
1 Grease gun nipple have been left attached to front wheel cylinder bleed nipples , these should be removed . Grease gun nipple have been left attached to front wheel cylinder bleed nipples , these should be removed . 09 June 2014 [14:45] 09/06/2014 168940364111 168940364111

MOT TEST: 16 September 2016 14:22:53 PASSED
MOT TEST: 16 September 2016 14:22:53 PASSED

This test (472119149044) was completed on the 16 September 2016 14:22:53 and PASSED the requirements for a valid MOT with 11 comments.

This test (472119149044) was completed on the 16 September 2016 14:22:53 and PASSED the requirements for a valid MOT with 11 comments.

Recorded mileage: 34,840

Recorded mileage: 34,840


ADVISORY


MOT TEST: 16 August 2016 14:56:42 FAILED
MOT TEST: 16 August 2016 14:56:42 FAILED

This test (722226335905) was completed on the 16 August 2016 14:56:42 and FAILED the requirements for a valid MOT with 11 comments.

This test (722226335905) was completed on the 16 August 2016 14:56:42 and FAILED the requirements for a valid MOT with 11 comments.

Recorded mileage: 34,840

Recorded mileage: 34,840


ADVISORY

FAIL


MOT TEST: 07 August 2015 15:59:00 PASSED
MOT TEST: 07 August 2015 15:59:00 PASSED

This test (288959515200) was completed on the 07 August 2015 15:59:00 and PASSED the requirements for a valid MOT with 2 comments.

This test (288959515200) was completed on the 07 August 2015 15:59:00 and PASSED the requirements for a valid MOT with 2 comments.

Recorded mileage: 29,459

Recorded mileage: 29,459


USER ENTERED


MOT TEST: 01 August 2014 08:36:14 PASSED
MOT TEST: 01 August 2014 08:36:14 PASSED

This test (127943914231) was completed on the 01 August 2014 08:36:14 and PASSED the requirements for a valid MOT with 4 comments.

This test (127943914231) was completed on the 01 August 2014 08:36:14 and PASSED the requirements for a valid MOT with 4 comments.

Recorded mileage: 22,364

Recorded mileage: 22,364


USER ENTERED


MOT TEST: 03 July 2014 10:31:14 FAILED
MOT TEST: 03 July 2014 10:31:14 FAILED

This test (455134084174) was completed on the 03 July 2014 10:31:14 and FAILED the requirements for a valid MOT with 7 comments.

This test (455134084174) was completed on the 03 July 2014 10:31:14 and FAILED the requirements for a valid MOT with 7 comments.

Recorded mileage: 22,163

Recorded mileage: 22,163


ADVISORY

FAIL

USER ENTERED


MOT TEST: 09 June 2014 14:45:07 FAILED
MOT TEST: 09 June 2014 14:45:07 FAILED

This test (168940364111) was completed on the 09 June 2014 14:45:07 and FAILED the requirements for a valid MOT with 32 comments.

This test (168940364111) was completed on the 09 June 2014 14:45:07 and FAILED the requirements for a valid MOT with 32 comments.

Recorded mileage: 22,148

Recorded mileage: 22,148


ADVISORY

FAIL

USER ENTERED


MOT TEST: 22 May 2013 10:38:34 PASSED
MOT TEST: 22 May 2013 10:38:34 PASSED

This test (245352043156) was completed on the 22 May 2013 10:38:34 and PASSED the requirements for a valid MOT with 0 comments.

This test (245352043156) was completed on the 22 May 2013 10:38:34 and PASSED the requirements for a valid MOT with 0 comments.

Recorded mileage: 15,251

Recorded mileage: 15,251


MOT TEST: 11 May 2012 13:25:59 PASSED
MOT TEST: 11 May 2012 13:25:59 PASSED

This test (698012532134) was completed on the 11 May 2012 13:25:59 and PASSED the requirements for a valid MOT with 0 comments.

This test (698012532134) was completed on the 11 May 2012 13:25:59 and PASSED the requirements for a valid MOT with 0 comments.

Recorded mileage: 13,657

Recorded mileage: 13,657


MOT TEST: 17 May 2011 12:44:13 PASSED
MOT TEST: 17 May 2011 12:44:13 PASSED

This test (929717531138) was completed on the 17 May 2011 12:44:13 and PASSED the requirements for a valid MOT with 0 comments.

This test (929717531138) was completed on the 17 May 2011 12:44:13 and PASSED the requirements for a valid MOT with 0 comments.

Recorded mileage: 10,777

Recorded mileage: 10,777