BTF 353J


BTF353J is registered to a Grey 1970, Morris Minor 1000 with a Petrol engine. It Failed its most recent MOT Test on the 05 July 2016

14 unique faults (16 Total) reported in its MOT History (2 Tests).

2 common/recurring faults, the most frequent (2 times) is: Coolant leak Heater hose to rear of cylinder head. ().

50% (1) MOT Pass Rate and a 50% (1) MOT Failure Rate.

92,215 recorded miles.

BTF 353J


BTF353J is registered to a Grey 1970, Morris Minor 1000 with a Petrol engine. It Failed its most recent MOT Test on the 05 July 2016

14 unique faults (16 Total) reported in its MOT History (2 Tests).

2 common/recurring faults, the most frequent (2 times) is: Coolant leak Heater hose to rear of cylinder head. ().

50% (1) MOT Pass Rate and a 50% (1) MOT Failure Rate.

92,215 recorded miles.

MOT PASS/Failure rate for BTF 353J

all MOT test results for BTF 353J represented as a percentage
MOT PASS/Failure rate for BTF 353J
all MOT test results for BTF 353J represented as a percentage

PERCENTAGE OF VEHICLE FAULTS WITH BTF 353J

ALL REPORTED FAULTS, DISPLAYED BY PERCENTAGE OF OCCURRENCE DURING ALL MOT TESTS
PERCENTAGE OF VEHICLE FAULTS WITH BTF 353J
ALL REPORTED FAULTS, DISPLAYED BY PERCENTAGE OF OCCURRENCE DURING ALL MOT TESTS
ADVISORY

FAIL

BTF 353J annual Faults by type

ALL REPORTED FAULTS, DISPLAYED over time and categorised by type
BTF 353J annual Faults by type
ALL REPORTED FAULTS, DISPLAYED over time and categorised by type

RECURRING FAULTS WITH BTF 353J

FAULTS THAT HAVE OCCURED MORE THAN ONCE DURING BTF 353J's MOT HISTORY
RECURRING FAULTS WITH BTF 353J
FAULTS THAT HAVE OCCURED MORE THAN ONCE DURING BTF 353J's MOT HISTORY
Fault Fault Test Date Test Date/Time Reference MOT Test Reference
2 Coolant leak heater hose to rear of cylinder head. () Coolant leak heater hose to rear of cylinder head. () 05 July 2016 [15:15] 05/07/2016 28 June 2016 [11:23] 28/06/2016 511170230936 511170230936 751779200358 751779200358
2 Nearside front passenger seat(s) missing at time of test () Nearside front passenger seat(s) missing at time of test () 05 July 2016 [15:15] 05/07/2016 28 June 2016 [11:23] 28/06/2016 511170230936 511170230936 751779200358 751779200358

ALL BTF 353J ADVISORIES [4]

ALL ADVISORIES, ORDERED by OCCURRENCE DURING BTF 353J's MOT HISTORY
ALL BTF 353J ADVISORIES [4]
ALL ADVISORIES, ORDERED by OCCURRENCE DURING BTF 353J's MOT HISTORY
Advisory Faults | source www.vehiclestats.co.uk
Fault Fault Test Date Test Date/Time Reference MOT Test Reference
2 Coolant leak heater hose to rear of cylinder head. () Coolant leak heater hose to rear of cylinder head. () 05 July 2016 [15:15] 05/07/2016 28 June 2016 [11:23] 28/06/2016 511170230936 511170230936 751779200358 751779200358
2 Nearside front passenger seat(s) missing at time of test () Nearside front passenger seat(s) missing at time of test () 05 July 2016 [15:15] 05/07/2016 28 June 2016 [11:23] 28/06/2016 511170230936 511170230936 751779200358 751779200358

ALL BTF 353J Failure Faults [12]

ALL Failure faults, ORDERED by OCCURRENCE DURING BTF 353J's MOT HISTORY
ALL BTF 353J Failure Faults [12]
ALL Failure faults, ORDERED by OCCURRENCE DURING BTF 353J's MOT HISTORY
Fail Faults | source www.vehiclestats.co.uk
Fault Fault Test Date Test Date/Time Reference MOT Test Reference
1 Nearside rear brake binding (3.7.b.1) Nearside rear brake binding (3.7.b.1) 28 June 2016 [11:23] 28/06/2016 751779200358 751779200358
1 Offside rear brake binding (3.7.b.1) Offside rear brake binding (3.7.b.1) 28 June 2016 [11:23] 28/06/2016 751779200358 751779200358
1 Brake pedal anti-slip provision missing at brake pedal. (3.3.a.1b) Brake pedal anti-slip provision missing at brake pedal. (3.3.a.1b) 28 June 2016 [11:23] 28/06/2016 751779200358 751779200358
1 Windscreen washer provides insufficient washer liquid (8.2.3) Windscreen washer provides insufficient washer liquid (8.2.3) 28 June 2016 [11:23] 28/06/2016 751779200358 751779200358
1 Horn control missing (1.6.1) Horn control missing (1.6.1) 28 June 2016 [11:23] 28/06/2016 751779200358 751779200358
1 Horn not working (1.6.2a) Horn not working (1.6.2a) 28 June 2016 [11:23] 28/06/2016 751779200358 751779200358
1 Offside rear direction indicator not working (1.4.a.2c) Offside rear direction indicator not working (1.4.a.2c) 28 June 2016 [11:23] 28/06/2016 751779200358 751779200358
1 Nearside stop lamp not working (1.2.1b) Nearside stop lamp not working (1.2.1b) 28 June 2016 [11:23] 28/06/2016 751779200358 751779200358
1 Passengers seat cannot be secured in the upright position. Rear seat squab. (6.2.a.2) Passengers seat cannot be secured in the upright position. Rear seat squab. (6.2.a.2) 28 June 2016 [11:23] 28/06/2016 751779200358 751779200358
1 Body has a sharp edge caused by corrosion at rear bumper nearside & offside end sections. (6.1.c.1) Body has a sharp edge caused by corrosion at rear bumper nearside & offside end sections. (6.1.c.1) 28 June 2016 [11:23] 28/06/2016 751779200358 751779200358
1 Offside front brake pipe inadequately supported pipe chaffing against engine. (3.6.b.1) Offside front brake pipe inadequately supported pipe chaffing against engine. (3.6.b.1) 28 June 2016 [11:23] 28/06/2016 751779200358 751779200358
1 Brake pipe inadequately supported both rear across rear axle. (3.6.b.1) Brake pipe inadequately supported both rear across rear axle. (3.6.b.1) 28 June 2016 [11:23] 28/06/2016 751779200358 751779200358

MOT TEST: 05 July 2016 15:15:58 PASSED
MOT TEST: 05 July 2016 15:15:58 PASSED

This test (511170230936) was completed on the 05 July 2016 15:15:58 and PASSED the requirements for a valid MOT with 2 comments.

This test (511170230936) was completed on the 05 July 2016 15:15:58 and PASSED the requirements for a valid MOT with 2 comments.

Recorded mileage: 92,215

Recorded mileage: 92,215


ADVISORY


MOT TEST: 28 June 2016 11:23:23 FAILED
MOT TEST: 28 June 2016 11:23:23 FAILED

This test (751779200358) was completed on the 28 June 2016 11:23:23 and FAILED the requirements for a valid MOT with 14 comments.

This test (751779200358) was completed on the 28 June 2016 11:23:23 and FAILED the requirements for a valid MOT with 14 comments.

Recorded mileage: 92,214

Recorded mileage: 92,214


ADVISORY

FAIL