COG 131C


COG131C is registered to a Green 1971, Morris Minor 1000 with a Petrol engine. It Passed its most recent MOT Test on the 25 April 2019

25 unique faults (27 Total) reported in its MOT History (11 Tests).

2 common/recurring faults, the most frequent (2 times) is: Parking brake: efficiency below requirements (3.7.B.7).

73% (8) MOT Pass Rate and a 27% (3) MOT Failure Rate.

46,347 recorded miles.

COG 131C


COG131C is registered to a Green 1971, Morris Minor 1000 with a Petrol engine. It Passed its most recent MOT Test on the 25 April 2019

25 unique faults (27 Total) reported in its MOT History (11 Tests).

2 common/recurring faults, the most frequent (2 times) is: Parking brake: efficiency below requirements (3.7.B.7).

73% (8) MOT Pass Rate and a 27% (3) MOT Failure Rate.

46,347 recorded miles.

MOT PASS/Failure rate for COG 131C

all MOT test results for COG 131C represented as a percentage
MOT PASS/Failure rate for COG 131C
all MOT test results for COG 131C represented as a percentage

PERCENTAGE OF VEHICLE FAULTS WITH COG 131C

ALL REPORTED FAULTS, DISPLAYED BY PERCENTAGE OF OCCURRENCE DURING ALL MOT TESTS
PERCENTAGE OF VEHICLE FAULTS WITH COG 131C
ALL REPORTED FAULTS, DISPLAYED BY PERCENTAGE OF OCCURRENCE DURING ALL MOT TESTS
ADVISORY

FAIL

COG 131C annual Faults by type

ALL REPORTED FAULTS, DISPLAYED over time and categorised by type
COG 131C annual Faults by type
ALL REPORTED FAULTS, DISPLAYED over time and categorised by type

RECURRING FAULTS WITH COG 131C

FAULTS THAT HAVE OCCURED MORE THAN ONCE DURING COG 131C's MOT HISTORY
RECURRING FAULTS WITH COG 131C
FAULTS THAT HAVE OCCURED MORE THAN ONCE DURING COG 131C's MOT HISTORY
Fault Fault Test Date Test Date/Time Reference MOT Test Reference
2 Parking brake: efficiency below requirements (3.7.b.7) Parking brake: efficiency below requirements (3.7.b.7) 08 August 2014 [09:26] 08/08/2014 09 July 2012 [11:10] 09/07/2012 786330824254 786330824254 276931392169 276931392169
2 Windscreen has damage to an area less than a 10mm circle within zone 'a' (8.3.1a) Windscreen has damage to an area less than a 10mm circle within zone 'a' (8.3.1a) 09 July 2013 [16:18] 09/07/2013 03 July 2013 [11:44] 03/07/2013 826680293176 826680293176 345844283140 345844283140

ALL COG 131C ADVISORIES [8]

ALL ADVISORIES, ORDERED by OCCURRENCE DURING COG 131C's MOT HISTORY
ALL COG 131C ADVISORIES [8]
ALL ADVISORIES, ORDERED by OCCURRENCE DURING COG 131C's MOT HISTORY
Advisory Faults | source www.vehiclestats.co.uk
Fault Fault Test Date Test Date/Time Reference MOT Test Reference
2 Windscreen has damage to an area less than a 10mm circle within zone 'a' (8.3.1a) Windscreen has damage to an area less than a 10mm circle within zone 'a' (8.3.1a) 09 July 2013 [16:18] 09/07/2013 03 July 2013 [11:44] 03/07/2013 826680293176 826680293176 345844283140 345844283140
1 Exhaust has a minor leak of exhaust gases (6.1.2 (a)) Exhaust has a minor leak of exhaust gases (6.1.2 (a)) 25 April 2019 [11:53] 25/04/2019 327525199502 327525199502
1 Centre exhaust has a minor leak of exhaust gases (7.1.2) Centre exhaust has a minor leak of exhaust gases (7.1.2) 09 July 2012 [11:10] 09/07/2012 276931392169 276931392169
1 Suspension component mounting prescribed area is corroded but not considered excessive (2.4.a.3) Suspension component mounting prescribed area is corroded but not considered excessive (2.4.a.3) 07 August 2009 [16:37] 07/08/2009 144249119285 144249119285
1 Rear shock absorber has slight corrosion to the casing (2.7.2a) Rear shock absorber has slight corrosion to the casing (2.7.2a) 07 August 2009 [16:37] 07/08/2009 144249119285 144249119285
1 Front suspension arm rubber bush deteriorated but not resulting in excessive movement (2.4.g.2) Front suspension arm rubber bush deteriorated but not resulting in excessive movement (2.4.g.2) 07 August 2009 [16:37] 07/08/2009 144249119285 144249119285
1 Front wheel bearing has slight play (2.5.a.3c) Front wheel bearing has slight play (2.5.a.3c) 07 August 2009 [16:37] 07/08/2009 144249119285 144249119285

ALL COG 131C Failure Faults [19]

ALL Failure faults, ORDERED by OCCURRENCE DURING COG 131C's MOT HISTORY
ALL COG 131C Failure Faults [19]
ALL Failure faults, ORDERED by OCCURRENCE DURING COG 131C's MOT HISTORY
Fail Faults | source www.vehiclestats.co.uk
Fault Fault Test Date Test Date/Time Reference MOT Test Reference
2 Parking brake: efficiency below requirements (3.7.b.7) Parking brake: efficiency below requirements (3.7.b.7) 08 August 2014 [09:26] 08/08/2014 09 July 2012 [11:10] 09/07/2012 786330824254 786330824254 276931392169 276931392169
1 Front passenger door cannot be opened from outside the vehicle (6.2.b.1b) Front passenger door cannot be opened from outside the vehicle (6.2.b.1b) 08 August 2014 [09:26] 08/08/2014 786330824254 786330824254
1 Nearside steering rack gaiter split (2.2.d.2d) Nearside steering rack gaiter split (2.2.d.2d) 08 August 2014 [09:26] 08/08/2014 786330824254 786330824254
1 Horn not working (1.6.2a) Horn not working (1.6.2a) 08 August 2014 [09:26] 08/08/2014 786330824254 786330824254
1 Nearside rear position lamp(s) not working (1.1.a.3b) Nearside rear position lamp(s) not working (1.1.a.3b) 03 July 2013 [11:44] 03/07/2013 345844283140 345844283140
1 Offside rear position lamp(s) not working (1.1.a.3b) Offside rear position lamp(s) not working (1.1.a.3b) 03 July 2013 [11:44] 03/07/2013 345844283140 345844283140
1 Nearside stop lamp not working (1.2.1b) Nearside stop lamp not working (1.2.1b) 03 July 2013 [11:44] 03/07/2013 345844283140 345844283140
1 Offside stop lamp not working (1.2.1b) Offside stop lamp not working (1.2.1b) 03 July 2013 [11:44] 03/07/2013 345844283140 345844283140
1 Hazard warning tell tale not working correctly (1.4.b.1e) Hazard warning tell tale not working correctly (1.4.b.1e) 03 July 2013 [11:44] 03/07/2013 345844283140 345844283140
1 Fuel cap/sealing device sealing washer missing (7.2.4c) Fuel cap/sealing device sealing washer missing (7.2.4c) 03 July 2013 [11:44] 03/07/2013 345844283140 345844283140
1 Nearside front front wheel bearing rough when rotated (2.5.a.2) Nearside front front wheel bearing rough when rotated (2.5.a.2) 03 July 2013 [11:44] 03/07/2013 345844283140 345844283140
1 Offside steering rack gaiter split (2.2.d.2d) Offside steering rack gaiter split (2.2.d.2d) 03 July 2013 [11:44] 03/07/2013 345844283140 345844283140
1 Offside rear brake binding (3.7.b.1) Offside rear brake binding (3.7.b.1) 03 July 2013 [11:44] 03/07/2013 345844283140 345844283140
1 Offside rear an item not tested (manual) Offside rear an item not tested (manual) 03 July 2013 [11:44] 03/07/2013 345844283140 345844283140
1 Nearside rear brake binding (3.7.b.1) Nearside rear brake binding (3.7.b.1) 09 July 2012 [11:10] 09/07/2012 276931392169 276931392169
1 Nearside rear an item not tested (manual) Nearside rear an item not tested (manual) 09 July 2012 [11:10] 09/07/2012 276931392169 276931392169
1 Nearside front axle king pin retaining device missing (2.5.a.3a) Nearside front axle king pin retaining device missing (2.5.a.3a) 09 July 2012 [11:10] 09/07/2012 276931392169 276931392169
1 Brakes imbalanced across an axle (3.7.b.5b) Brakes imbalanced across an axle (3.7.b.5b) 09 July 2012 [11:10] 09/07/2012 276931392169 276931392169

MOT TEST: 25 April 2019 11:53:30 PASSED
MOT TEST: 25 April 2019 11:53:30 PASSED

This test (327525199502) was completed on the 25 April 2019 11:53:30 and PASSED the requirements for a valid MOT with 1 comments.

This test (327525199502) was completed on the 25 April 2019 11:53:30 and PASSED the requirements for a valid MOT with 1 comments.

Recorded mileage: 46,347

Recorded mileage: 46,347


ADVISORY


MOT TEST: 17 April 2018 09:38:07 PASSED
MOT TEST: 17 April 2018 09:38:07 PASSED

This test (140839495010) was completed on the 17 April 2018 09:38:07 and PASSED the requirements for a valid MOT with 0 comments.

This test (140839495010) was completed on the 17 April 2018 09:38:07 and PASSED the requirements for a valid MOT with 0 comments.

Recorded mileage: 46,298

Recorded mileage: 46,298


MOT TEST: 27 April 2017 13:46:42 PASSED
MOT TEST: 27 April 2017 13:46:42 PASSED

This test (624995887532) was completed on the 27 April 2017 13:46:42 and PASSED the requirements for a valid MOT with 0 comments.

This test (624995887532) was completed on the 27 April 2017 13:46:42 and PASSED the requirements for a valid MOT with 0 comments.

Recorded mileage: 45,885

Recorded mileage: 45,885


MOT TEST: 13 August 2014 16:09:36 PASSED
MOT TEST: 13 August 2014 16:09:36 PASSED

This test (388525924293) was completed on the 13 August 2014 16:09:36 and PASSED the requirements for a valid MOT with 0 comments.

This test (388525924293) was completed on the 13 August 2014 16:09:36 and PASSED the requirements for a valid MOT with 0 comments.

Recorded mileage: 45,541

Recorded mileage: 45,541


MOT TEST: 08 August 2014 09:26:22 FAILED
MOT TEST: 08 August 2014 09:26:22 FAILED

This test (786330824254) was completed on the 08 August 2014 09:26:22 and FAILED the requirements for a valid MOT with 4 comments.

This test (786330824254) was completed on the 08 August 2014 09:26:22 and FAILED the requirements for a valid MOT with 4 comments.

Recorded mileage: 45,540

Recorded mileage: 45,540


FAIL


MOT TEST: 09 July 2013 16:18:43 PASSED
MOT TEST: 09 July 2013 16:18:43 PASSED

This test (826680293176) was completed on the 09 July 2013 16:18:43 and PASSED the requirements for a valid MOT with 1 comments.

This test (826680293176) was completed on the 09 July 2013 16:18:43 and PASSED the requirements for a valid MOT with 1 comments.

Recorded mileage: 45,165

Recorded mileage: 45,165


ADVISORY


MOT TEST: 03 July 2013 11:44:09 FAILED
MOT TEST: 03 July 2013 11:44:09 FAILED

This test (345844283140) was completed on the 03 July 2013 11:44:09 and FAILED the requirements for a valid MOT with 11 comments.

This test (345844283140) was completed on the 03 July 2013 11:44:09 and FAILED the requirements for a valid MOT with 11 comments.

Recorded mileage: 45,144

Recorded mileage: 45,144


ADVISORY

FAIL


MOT TEST: 19 July 2012 16:23:47 PASSED
MOT TEST: 19 July 2012 16:23:47 PASSED

This test (607981302291) was completed on the 19 July 2012 16:23:47 and PASSED the requirements for a valid MOT with 0 comments.

This test (607981302291) was completed on the 19 July 2012 16:23:47 and PASSED the requirements for a valid MOT with 0 comments.

Recorded mileage: 44,478

Recorded mileage: 44,478


MOT TEST: 09 July 2012 11:10:43 FAILED
MOT TEST: 09 July 2012 11:10:43 FAILED

This test (276931392169) was completed on the 09 July 2012 11:10:43 and FAILED the requirements for a valid MOT with 6 comments.

This test (276931392169) was completed on the 09 July 2012 11:10:43 and FAILED the requirements for a valid MOT with 6 comments.

Recorded mileage: 44,477

Recorded mileage: 44,477


ADVISORY

FAIL


MOT TEST: 15 July 2011 15:49:21 PASSED
MOT TEST: 15 July 2011 15:49:21 PASSED

This test (989486891147) was completed on the 15 July 2011 15:49:21 and PASSED the requirements for a valid MOT with 0 comments.

This test (989486891147) was completed on the 15 July 2011 15:49:21 and PASSED the requirements for a valid MOT with 0 comments.

Recorded mileage: 43,625

Recorded mileage: 43,625


MOT TEST: 07 August 2009 16:37:58 PASSED
MOT TEST: 07 August 2009 16:37:58 PASSED

This test (144249119285) was completed on the 07 August 2009 16:37:58 and PASSED the requirements for a valid MOT with 4 comments.

This test (144249119285) was completed on the 07 August 2009 16:37:58 and PASSED the requirements for a valid MOT with 4 comments.

Recorded mileage: 34,685

Recorded mileage: 34,685


ADVISORY