DJK 138


DJK138 is registered to a White 1956, Morris Minor with a Petrol engine. It Failed its most recent MOT Test on the 16 June 2012

8 unique faults (8 Total) reported in its MOT History (7 Tests).

0 common/recurring faults.

86% (6) MOT Pass Rate and a 14% (1) MOT Failure Rate.

5,796 recorded miles.

DJK 138


DJK138 is registered to a White 1956, Morris Minor with a Petrol engine. It Failed its most recent MOT Test on the 16 June 2012

8 unique faults (8 Total) reported in its MOT History (7 Tests).

0 common/recurring faults.

86% (6) MOT Pass Rate and a 14% (1) MOT Failure Rate.

5,796 recorded miles.

MOT PASS/Failure rate for DJK 138

all MOT test results for DJK 138 represented as a percentage
MOT PASS/Failure rate for DJK 138
all MOT test results for DJK 138 represented as a percentage

PERCENTAGE OF VEHICLE FAULTS WITH DJK 138

ALL REPORTED FAULTS, DISPLAYED BY PERCENTAGE OF OCCURRENCE DURING ALL MOT TESTS
PERCENTAGE OF VEHICLE FAULTS WITH DJK 138
ALL REPORTED FAULTS, DISPLAYED BY PERCENTAGE OF OCCURRENCE DURING ALL MOT TESTS
ADVISORY

FAIL

USER ENTERED

DJK 138 annual Faults by type

ALL REPORTED FAULTS, DISPLAYED over time and categorised by type
DJK 138 annual Faults by type
ALL REPORTED FAULTS, DISPLAYED over time and categorised by type

ALL DJK 138 ADVISORIES [1]

ALL ADVISORIES, ORDERED by OCCURRENCE DURING DJK 138's MOT HISTORY
ALL DJK 138 ADVISORIES [1]
ALL ADVISORIES, ORDERED by OCCURRENCE DURING DJK 138's MOT HISTORY
Advisory Faults | source www.vehiclestats.co.uk
Fault Fault Test Date Test Date/Time Reference MOT Test Reference
1 Nearside front front suspension has slight play in a lower suspension ball joint (2.5.b.1a) Nearside front front suspension has slight play in a lower suspension ball joint (2.5.b.1a) 28 June 2010 [19:20] 28/06/2010 901609670147 901609670147

ALL DJK 138 Failure Faults [5]

ALL Failure faults, ORDERED by OCCURRENCE DURING DJK 138's MOT HISTORY
ALL DJK 138 Failure Faults [5]
ALL Failure faults, ORDERED by OCCURRENCE DURING DJK 138's MOT HISTORY
Fail Faults | source www.vehiclestats.co.uk
Fault Fault Test Date Test Date/Time Reference MOT Test Reference
1 Windscreen washer provides insufficient washer liquid (8.2.3) Windscreen washer provides insufficient washer liquid (8.2.3) 19 June 2006 [20:19] 19/06/2006 431230576139 431230576139
1 Nearside front brake binding (3.7.b.1) Nearside front brake binding (3.7.b.1) 19 June 2006 [20:19] 19/06/2006 431230576139 431230576139
1 Nearside front brake performance not tested (3.7.a.1) Nearside front brake performance not tested (3.7.a.1) 19 June 2006 [20:19] 19/06/2006 431230576139 431230576139
1 Service brake: efficiency below requirements (3.7.b.7) Service brake: efficiency below requirements (3.7.b.7) 19 June 2006 [20:19] 19/06/2006 431230576139 431230576139
1 Parking brake: efficiency below requirements (3.7.b.7) Parking brake: efficiency below requirements (3.7.b.7) 19 June 2006 [20:19] 19/06/2006 431230576139 431230576139

ALL DJK 138 User Entered Faults [2]

ALL User Entered faults, ORDERED by OCCURRENCE DURING DJK 138's MOT HISTORY
ALL DJK 138 User Entered Faults [2]
ALL User Entered faults, ORDERED by OCCURRENCE DURING DJK 138's MOT HISTORY
User Entered Faults | source www.vehiclestats.co.uk
Fault Fault Test Date Test Date/Time Reference MOT Test Reference
1 Both aftermarket indicators showing white light Both aftermarket indicators showing white light 16 June 2012 [13:23] 16/06/2012 507578162168 507578162168
1 Slight play nearside and offside front lower suspension trunnion Slight play nearside and offside front lower suspension trunnion 19 June 2006 [20:19] 19/06/2006 431230576139 431230576139

MOT TEST: 16 June 2012 13:23:31 PASSED
MOT TEST: 16 June 2012 13:23:31 PASSED

This test (507578162168) was completed on the 16 June 2012 13:23:31 and PASSED the requirements for a valid MOT with 1 comments.

This test (507578162168) was completed on the 16 June 2012 13:23:31 and PASSED the requirements for a valid MOT with 1 comments.

Recorded mileage: 5,796

Recorded mileage: 5,796


USER ENTERED


MOT TEST: 28 June 2010 19:20:45 PASSED
MOT TEST: 28 June 2010 19:20:45 PASSED

This test (901609670147) was completed on the 28 June 2010 19:20:45 and PASSED the requirements for a valid MOT with 1 comments.

This test (901609670147) was completed on the 28 June 2010 19:20:45 and PASSED the requirements for a valid MOT with 1 comments.

Recorded mileage: 5,772

Recorded mileage: 5,772


ADVISORY


MOT TEST: 06 July 2009 19:09:25 PASSED
MOT TEST: 06 July 2009 19:09:25 PASSED

This test (190407489178) was completed on the 06 July 2009 19:09:25 and PASSED the requirements for a valid MOT with 0 comments.

This test (190407489178) was completed on the 06 July 2009 19:09:25 and PASSED the requirements for a valid MOT with 0 comments.

Recorded mileage: 5,763

Recorded mileage: 5,763


MOT TEST: 10 July 2008 19:16:13 PASSED
MOT TEST: 10 July 2008 19:16:13 PASSED

This test (142052298117) was completed on the 10 July 2008 19:16:13 and PASSED the requirements for a valid MOT with 0 comments.

This test (142052298117) was completed on the 10 July 2008 19:16:13 and PASSED the requirements for a valid MOT with 0 comments.

Recorded mileage: 5,755

Recorded mileage: 5,755


MOT TEST: 27 June 2007 13:52:28 PASSED
MOT TEST: 27 June 2007 13:52:28 PASSED

This test (940758077128) was completed on the 27 June 2007 13:52:28 and PASSED the requirements for a valid MOT with 0 comments.

This test (940758077128) was completed on the 27 June 2007 13:52:28 and PASSED the requirements for a valid MOT with 0 comments.

Recorded mileage: 5,658

Recorded mileage: 5,658


MOT TEST: 11 July 2006 11:08:18 PASSED
MOT TEST: 11 July 2006 11:08:18 PASSED

This test (584232596145) was completed on the 11 July 2006 11:08:18 and PASSED the requirements for a valid MOT with 0 comments.

This test (584232596145) was completed on the 11 July 2006 11:08:18 and PASSED the requirements for a valid MOT with 0 comments.

Recorded mileage: 5,557

Recorded mileage: 5,557


MOT TEST: 19 June 2006 20:19:55 FAILED
MOT TEST: 19 June 2006 20:19:55 FAILED

This test (431230576139) was completed on the 19 June 2006 20:19:55 and FAILED the requirements for a valid MOT with 6 comments.

This test (431230576139) was completed on the 19 June 2006 20:19:55 and FAILED the requirements for a valid MOT with 6 comments.

Recorded mileage: 5,557

Recorded mileage: 5,557


FAIL

USER ENTERED