DJK 240E


DJK240E is registered to a White 1967, Morris Minor 1000 with a Petrol engine. It Failed its most recent MOT Test on the 04 July 2017

30 unique faults (36 Total) reported in its MOT History (16 Tests).

6 common/recurring faults, the most frequent (2 times) is: oil leak.

69% (11) MOT Pass Rate and a 31% (5) MOT Failure Rate.

36,789 recorded miles.

DJK 240E


DJK240E is registered to a White 1967, Morris Minor 1000 with a Petrol engine. It Failed its most recent MOT Test on the 04 July 2017

30 unique faults (36 Total) reported in its MOT History (16 Tests).

6 common/recurring faults, the most frequent (2 times) is: oil leak.

69% (11) MOT Pass Rate and a 31% (5) MOT Failure Rate.

36,789 recorded miles.

MOT PASS/Failure rate for DJK 240E

all MOT test results for DJK 240E represented as a percentage
MOT PASS/Failure rate for DJK 240E
all MOT test results for DJK 240E represented as a percentage

PERCENTAGE OF VEHICLE FAULTS WITH DJK 240E

ALL REPORTED FAULTS, DISPLAYED BY PERCENTAGE OF OCCURRENCE DURING ALL MOT TESTS
PERCENTAGE OF VEHICLE FAULTS WITH DJK 240E
ALL REPORTED FAULTS, DISPLAYED BY PERCENTAGE OF OCCURRENCE DURING ALL MOT TESTS
ADVISORY

FAIL

USER ENTERED

PASS WITH RECTIFICATION

DJK 240E annual Faults by type

ALL REPORTED FAULTS, DISPLAYED over time and categorised by type
DJK 240E annual Faults by type
ALL REPORTED FAULTS, DISPLAYED over time and categorised by type

RECURRING FAULTS WITH DJK 240E

FAULTS THAT HAVE OCCURED MORE THAN ONCE DURING DJK 240E's MOT HISTORY
RECURRING FAULTS WITH DJK 240E
FAULTS THAT HAVE OCCURED MORE THAN ONCE DURING DJK 240E's MOT HISTORY
Fault Fault Test Date Test Date/Time Reference MOT Test Reference
2 Oil leak Oil leak 03 June 2016 [13:55] 03/06/2016 02 June 2016 [10:22] 02/06/2016 601682116328 601682116328 393359041715 393359041715
2 Prop shaft front uj has slight play Prop shaft front uj has slight play 03 June 2016 [13:55] 03/06/2016 02 June 2016 [10:22] 02/06/2016 601682116328 601682116328 393359041715 393359041715
2 Parking brake: efficiency below requirements (3.7.b.7) Parking brake: efficiency below requirements (3.7.b.7) 03 March 2014 [10:03] 03/03/2014 26 January 2011 [12:39] 26/01/2011 577062264009 577062264009 898976821075 898976821075
2 Nearside headlamp deteriorated but light output not reduced (1.7.5a) Nearside headlamp deteriorated but light output not reduced (1.7.5a) 27 January 2011 [16:12] 27/01/2011 26 January 2011 [12:39] 26/01/2011 879137321078 879137321078 898976821075 898976821075
2 Offside headlamp deteriorated but light output not reduced (1.7.5a) Offside headlamp deteriorated but light output not reduced (1.7.5a) 27 January 2011 [16:12] 27/01/2011 26 January 2011 [12:39] 26/01/2011 879137321078 879137321078 898976821075 898976821075
2 Nearside outer track rod end joint cover split/missing Nearside outer track rod end joint cover split/missing 26 January 2011 [12:39] 26/01/2011 05 February 2010 [11:02] 05/02/2010 898976821075 898976821075 280576030083 280576030083

ALL DJK 240E ADVISORIES [17]

ALL ADVISORIES, ORDERED by OCCURRENCE DURING DJK 240E's MOT HISTORY
ALL DJK 240E ADVISORIES [17]
ALL ADVISORIES, ORDERED by OCCURRENCE DURING DJK 240E's MOT HISTORY
Advisory Faults | source www.vehiclestats.co.uk
Fault Fault Test Date Test Date/Time Reference MOT Test Reference
2 Oil leak Oil leak 03 June 2016 [13:55] 03/06/2016 02 June 2016 [10:22] 02/06/2016 601682116328 601682116328 393359041715 393359041715
2 Prop shaft front uj has slight play Prop shaft front uj has slight play 03 June 2016 [13:55] 03/06/2016 02 June 2016 [10:22] 02/06/2016 601682116328 601682116328 393359041715 393359041715
2 Nearside headlamp deteriorated but light output not reduced (1.7.5a) Nearside headlamp deteriorated but light output not reduced (1.7.5a) 27 January 2011 [16:12] 27/01/2011 26 January 2011 [12:39] 26/01/2011 879137321078 879137321078 898976821075 898976821075
2 Offside headlamp deteriorated but light output not reduced (1.7.5a) Offside headlamp deteriorated but light output not reduced (1.7.5a) 27 January 2011 [16:12] 27/01/2011 26 January 2011 [12:39] 26/01/2011 879137321078 879137321078 898976821075 898976821075
1 Nearside front suspension arm rubber bush deteriorated but not resulting in excessive movement (2.4.g.2) Nearside front suspension arm rubber bush deteriorated but not resulting in excessive movement (2.4.g.2) 27 January 2011 [16:12] 27/01/2011 879137321078 879137321078
1 Nearside front suspension component mounting prescribed area is corroded but not considered excessive (2.4.a.3) Nearside front suspension component mounting prescribed area is corroded but not considered excessive (2.4.a.3) 27 January 2011 [16:12] 27/01/2011 879137321078 879137321078
1 Nearside front lower suspension arm has slight play in a pin/bush (2.4.g.2) Nearside front lower suspension arm has slight play in a pin/bush (2.4.g.2) 26 January 2011 [12:39] 26/01/2011 898976821075 898976821075
1 Nearside front subframe mounting prescribed area is corroded but not considered excessive (2.4.a.3) Nearside front subframe mounting prescribed area is corroded but not considered excessive (2.4.a.3) 26 January 2011 [12:39] 26/01/2011 898976821075 898976821075
1 Offside front subframe mounting prescribed area is corroded but not considered excessive (2.4.a.3) Offside front subframe mounting prescribed area is corroded but not considered excessive (2.4.a.3) 05 February 2010 [11:02] 05/02/2010 280576030083 280576030083
1 Offside rear suspension spring mounting prescribed area is corroded but not considered excessive (2.4.a.3) Offside rear suspension spring mounting prescribed area is corroded but not considered excessive (2.4.a.3) 05 February 2010 [11:02] 05/02/2010 280576030083 280576030083
1 Nearside seat belt anchorage prescribed area is corroded but not considered excessive (5.2.6) Nearside seat belt anchorage prescribed area is corroded but not considered excessive (5.2.6) 05 February 2010 [11:02] 05/02/2010 280576030083 280576030083
1 Nearside front lower suspension arm rubber bush deteriorated but not resulting in excessive movement (2.4.g.2) Nearside front lower suspension arm rubber bush deteriorated but not resulting in excessive movement (2.4.g.2) 05 February 2010 [11:02] 05/02/2010 280576030083 280576030083
1 Steering column top bearing slightly worn (2.1.2c) Steering column top bearing slightly worn (2.1.2c) 05 February 2010 [11:02] 05/02/2010 280576030083 280576030083

ALL DJK 240E Failure Faults [11]

ALL Failure faults, ORDERED by OCCURRENCE DURING DJK 240E's MOT HISTORY
ALL DJK 240E Failure Faults [11]
ALL Failure faults, ORDERED by OCCURRENCE DURING DJK 240E's MOT HISTORY
Fail Faults | source www.vehiclestats.co.uk
Fault Fault Test Date Test Date/Time Reference MOT Test Reference
2 Parking brake: efficiency below requirements (3.7.b.7) Parking brake: efficiency below requirements (3.7.b.7) 03 March 2014 [10:03] 03/03/2014 26 January 2011 [12:39] 26/01/2011 577062264009 577062264009 898976821075 898976821075
1 Rear brakes imbalanced across an axle axle 2 (3.7.b.5b) Rear brakes imbalanced across an axle axle 2 (3.7.b.5b) 02 June 2016 [10:22] 02/06/2016 393359041715 393359041715
1 Nearside front track rod end ball joint dust cover excessively deteriorated so that it no longer prevents the ingress of dirt (2.2.c.1c) Nearside front track rod end ball joint dust cover excessively deteriorated so that it no longer prevents the ingress of dirt (2.2.c.1c) 02 June 2016 [10:22] 02/06/2016 393359041715 393359041715
1 Offside rear suspension component mounting prescribed area is excessively corroded floor above spring (2.4.a.3) Offside rear suspension component mounting prescribed area is excessively corroded floor above spring (2.4.a.3) 02 June 2016 [10:22] 02/06/2016 393359041715 393359041715
1 Front headlamp adversely affected by the operation of another lamp (1.7.5c) Front headlamp adversely affected by the operation of another lamp (1.7.5c) 03 March 2014 [10:03] 03/03/2014 577062264009 577062264009
1 Front brake binding (3.7.b.1) Front brake binding (3.7.b.1) 03 March 2014 [10:03] 03/03/2014 577062264009 577062264009
1 Rear brake binding (3.7.b.1) Rear brake binding (3.7.b.1) 03 March 2014 [10:03] 03/03/2014 577062264009 577062264009
1 Brakes imbalanced across an axle (3.7.b.5b) Brakes imbalanced across an axle (3.7.b.5b) 03 March 2014 [10:03] 03/03/2014 577062264009 577062264009
1 Service brake: efficiency below requirements (3.7.b.7) Service brake: efficiency below requirements (3.7.b.7) 26 January 2011 [12:39] 26/01/2011 898976821075 898976821075
1 Indicator tell tale inoperative (1.4.a.2a) Indicator tell tale inoperative (1.4.a.2a) 26 January 2011 [12:39] 26/01/2011 898976821075 898976821075

ALL DJK 240E User Entered Faults [4]

ALL User Entered faults, ORDERED by OCCURRENCE DURING DJK 240E's MOT HISTORY
ALL DJK 240E User Entered Faults [4]
ALL User Entered faults, ORDERED by OCCURRENCE DURING DJK 240E's MOT HISTORY
Fail Faults | source www.vehiclestats.co.uk
Fault Fault Test Date Test Date/Time Reference MOT Test Reference
2 Nearside outer track rod end joint cover split/missing Nearside outer track rod end joint cover split/missing 26 January 2011 [12:39] 26/01/2011 05 February 2010 [11:02] 05/02/2010 898976821075 898976821075 280576030083 280576030083
1 N/s track rod end gaitor split N/s track rod end gaitor split 27 January 2011 [16:12] 27/01/2011 879137321078 879137321078
1 O/s/rear leaf spring weak O/s/rear leaf spring weak 05 February 2010 [11:02] 05/02/2010 280576030083 280576030083

ALL DJK 240E Pass With Rectification Faults [4]

ALL Pass With Rectification faults, ORDERED by OCCURRENCE DURING DJK 240E's MOT HISTORY
ALL DJK 240E Pass With Rectification Faults [4]
ALL Pass With Rectification faults, ORDERED by OCCURRENCE DURING DJK 240E's MOT HISTORY
Pass With Rectification Faults | source www.vehiclestats.co.uk
Fault Fault Test Date Test Date/Time Reference MOT Test Reference
1 Offside rear front brake binding (3.7.b.1) Offside rear front brake binding (3.7.b.1) 20 January 2009 [12:15] 20/01/2009 534090129023 534090129023
1 Offside front front brake binding (3.7.b.1) Offside front front brake binding (3.7.b.1) 20 January 2009 [12:15] 20/01/2009 534090129023 534090129023
1 Offside steering rack insecure (2.2.b.1a) Offside steering rack insecure (2.2.b.1a) 03 July 2007 [12:54] 03/07/2007 844154987196 844154987196
1 Headlamp aim too high (1.8) Headlamp aim too high (1.8) 03 July 2007 [12:54] 03/07/2007 844154987196 844154987196

MOT TEST: 04 July 2017 10:06:28 PASSED
MOT TEST: 04 July 2017 10:06:28 PASSED

This test (278621698032) was completed on the 04 July 2017 10:06:28 and PASSED the requirements for a valid MOT with 0 comments.

This test (278621698032) was completed on the 04 July 2017 10:06:28 and PASSED the requirements for a valid MOT with 0 comments.

Recorded mileage: 36,789

Recorded mileage: 36,789


MOT TEST: 03 June 2016 13:55:13 PASSED
MOT TEST: 03 June 2016 13:55:13 PASSED

This test (601682116328) was completed on the 03 June 2016 13:55:13 and PASSED the requirements for a valid MOT with 2 comments.

This test (601682116328) was completed on the 03 June 2016 13:55:13 and PASSED the requirements for a valid MOT with 2 comments.

Recorded mileage: 36,390

Recorded mileage: 36,390


ADVISORY


MOT TEST: 02 June 2016 10:22:35 FAILED
MOT TEST: 02 June 2016 10:22:35 FAILED

This test (393359041715) was completed on the 02 June 2016 10:22:35 and FAILED the requirements for a valid MOT with 5 comments.

This test (393359041715) was completed on the 02 June 2016 10:22:35 and FAILED the requirements for a valid MOT with 5 comments.

Recorded mileage: 36,390

Recorded mileage: 36,390


ADVISORY

FAIL


MOT TEST: 23 March 2015 15:01:45 PASSED
MOT TEST: 23 March 2015 15:01:45 PASSED

This test (618972185021) was completed on the 23 March 2015 15:01:45 and PASSED the requirements for a valid MOT with 0 comments.

This test (618972185021) was completed on the 23 March 2015 15:01:45 and PASSED the requirements for a valid MOT with 0 comments.

Recorded mileage: 35,931

Recorded mileage: 35,931


MOT TEST: 06 March 2014 13:57:54 PASSED
MOT TEST: 06 March 2014 13:57:54 PASSED

This test (107125564423) was completed on the 06 March 2014 13:57:54 and PASSED the requirements for a valid MOT with 0 comments.

This test (107125564423) was completed on the 06 March 2014 13:57:54 and PASSED the requirements for a valid MOT with 0 comments.

Recorded mileage: 35,463

Recorded mileage: 35,463


MOT TEST: 03 March 2014 10:03:30 FAILED
MOT TEST: 03 March 2014 10:03:30 FAILED

This test (577062264009) was completed on the 03 March 2014 10:03:30 and FAILED the requirements for a valid MOT with 5 comments.

This test (577062264009) was completed on the 03 March 2014 10:03:30 and FAILED the requirements for a valid MOT with 5 comments.

Recorded mileage: 35,463

Recorded mileage: 35,463


FAIL


MOT TEST: 11 February 2013 11:12:29 PASSED
MOT TEST: 11 February 2013 11:12:29 PASSED

This test (106382043005) was completed on the 11 February 2013 11:12:29 and PASSED the requirements for a valid MOT with 0 comments.

This test (106382043005) was completed on the 11 February 2013 11:12:29 and PASSED the requirements for a valid MOT with 0 comments.

Recorded mileage: 35,419

Recorded mileage: 35,419


MOT TEST: 15 February 2012 11:17:02 PASSED
MOT TEST: 15 February 2012 11:17:02 PASSED

This test (119296742423) was completed on the 15 February 2012 11:17:02 and PASSED the requirements for a valid MOT with 0 comments.

This test (119296742423) was completed on the 15 February 2012 11:17:02 and PASSED the requirements for a valid MOT with 0 comments.

Recorded mileage: 35,322

Recorded mileage: 35,322


MOT TEST: 27 January 2011 16:12:53 PASSED
MOT TEST: 27 January 2011 16:12:53 PASSED

This test (879137321078) was completed on the 27 January 2011 16:12:53 and PASSED the requirements for a valid MOT with 5 comments.

This test (879137321078) was completed on the 27 January 2011 16:12:53 and PASSED the requirements for a valid MOT with 5 comments.

Recorded mileage: 35,119

Recorded mileage: 35,119


ADVISORY

USER ENTERED


MOT TEST: 26 January 2011 12:39:46 FAILED
MOT TEST: 26 January 2011 12:39:46 FAILED

This test (898976821075) was completed on the 26 January 2011 12:39:46 and FAILED the requirements for a valid MOT with 8 comments.

This test (898976821075) was completed on the 26 January 2011 12:39:46 and FAILED the requirements for a valid MOT with 8 comments.

Recorded mileage: 35,119

Recorded mileage: 35,119


ADVISORY

FAIL

USER ENTERED


MOT TEST: 05 February 2010 11:02:03 PASSED
MOT TEST: 05 February 2010 11:02:03 PASSED

This test (280576030083) was completed on the 05 February 2010 11:02:03 and PASSED the requirements for a valid MOT with 7 comments.

This test (280576030083) was completed on the 05 February 2010 11:02:03 and PASSED the requirements for a valid MOT with 7 comments.

Recorded mileage: 34,658

Recorded mileage: 34,658


ADVISORY

USER ENTERED


MOT TEST: 20 January 2009 12:15:28 PASSED
MOT TEST: 20 January 2009 12:15:28 PASSED

This test (544940029069) was completed on the 20 January 2009 12:15:28 and PASSED the requirements for a valid MOT with 0 comments.

This test (544940029069) was completed on the 20 January 2009 12:15:28 and PASSED the requirements for a valid MOT with 0 comments.

Recorded mileage: 34,450

Recorded mileage: 34,450


MOT TEST: 20 January 2009 12:15:28 FAILED
MOT TEST: 20 January 2009 12:15:28 FAILED

This test (534090129023) was completed on the 20 January 2009 12:15:28 and FAILED the requirements for a valid MOT with 2 comments.

This test (534090129023) was completed on the 20 January 2009 12:15:28 and FAILED the requirements for a valid MOT with 2 comments.

Recorded mileage: 34,450

Recorded mileage: 34,450


PASS WITH RECTIFICATION


MOT TEST: 03 July 2007 12:54:49 PASSED
MOT TEST: 03 July 2007 12:54:49 PASSED

This test (170164887169) was completed on the 03 July 2007 12:54:49 and PASSED the requirements for a valid MOT with 0 comments.

This test (170164887169) was completed on the 03 July 2007 12:54:49 and PASSED the requirements for a valid MOT with 0 comments.

Recorded mileage: 34,246

Recorded mileage: 34,246


MOT TEST: 03 July 2007 12:54:49 FAILED
MOT TEST: 03 July 2007 12:54:49 FAILED

This test (844154987196) was completed on the 03 July 2007 12:54:49 and FAILED the requirements for a valid MOT with 2 comments.

This test (844154987196) was completed on the 03 July 2007 12:54:49 and FAILED the requirements for a valid MOT with 2 comments.

Recorded mileage: 34,246

Recorded mileage: 34,246


PASS WITH RECTIFICATION


MOT TEST: 04 July 2006 11:32:00 PASSED
MOT TEST: 04 July 2006 11:32:00 PASSED

This test (254665486459) was completed on the 04 July 2006 11:32:00 and PASSED the requirements for a valid MOT with 0 comments.

This test (254665486459) was completed on the 04 July 2006 11:32:00 and PASSED the requirements for a valid MOT with 0 comments.

Recorded mileage: 33,995

Recorded mileage: 33,995