DJO 415D


DJO415D is registered to a White 1966, Morris Minor 1000 with a Petrol engine. It Failed its most recent MOT Test on the 22 June 2017

23 unique faults (29 Total) reported in its MOT History (14 Tests).

6 common/recurring faults, the most frequent (2 times) is: Nearside Front Seat missing at time of test.

79% (11) MOT Pass Rate and a 21% (3) MOT Failure Rate.

81,229 recorded miles.

DJO 415D


DJO415D is registered to a White 1966, Morris Minor 1000 with a Petrol engine. It Failed its most recent MOT Test on the 22 June 2017

23 unique faults (29 Total) reported in its MOT History (14 Tests).

6 common/recurring faults, the most frequent (2 times) is: Nearside Front Seat missing at time of test.

79% (11) MOT Pass Rate and a 21% (3) MOT Failure Rate.

81,229 recorded miles.

MOT PASS/Failure rate for DJO 415D

all MOT test results for DJO 415D represented as a percentage
MOT PASS/Failure rate for DJO 415D
all MOT test results for DJO 415D represented as a percentage

PERCENTAGE OF VEHICLE FAULTS WITH DJO 415D

ALL REPORTED FAULTS, DISPLAYED BY PERCENTAGE OF OCCURRENCE DURING ALL MOT TESTS
PERCENTAGE OF VEHICLE FAULTS WITH DJO 415D
ALL REPORTED FAULTS, DISPLAYED BY PERCENTAGE OF OCCURRENCE DURING ALL MOT TESTS
ADVISORY

FAIL

USER ENTERED

DJO 415D annual Faults by type

ALL REPORTED FAULTS, DISPLAYED over time and categorised by type
DJO 415D annual Faults by type
ALL REPORTED FAULTS, DISPLAYED over time and categorised by type

RECURRING FAULTS WITH DJO 415D

FAULTS THAT HAVE OCCURED MORE THAN ONCE DURING DJO 415D's MOT HISTORY
RECURRING FAULTS WITH DJO 415D
FAULTS THAT HAVE OCCURED MORE THAN ONCE DURING DJO 415D's MOT HISTORY
Fault Fault Test Date Test Date/Time Reference MOT Test Reference
2 Nearside front seat missing at time of test Nearside front seat missing at time of test 22 June 2017 [06:03] 22/06/2017 21 June 2017 [09:30] 21/06/2017 928638573766 928638573766 477123382760 477123382760
2 All four tyres starting to perish over tread pattern All four tyres starting to perish over tread pattern 22 June 2017 [06:03] 22/06/2017 21 June 2017 [09:30] 21/06/2017 928638573766 928638573766 477123382760 477123382760
2 Passenger front seat has been removed Passenger front seat has been removed 23 June 2016 [08:59] 23/06/2016 16 June 2016 [07:35] 16/06/2016 531127050994 531127050994 960382934875 960382934875
2 Slight drag on offside rear brake Slight drag on offside rear brake 23 June 2016 [08:59] 23/06/2016 16 June 2016 [07:35] 16/06/2016 531127050994 531127050994 960382934875 960382934875
2 Nearside rear suspension spring mounting prescribed area is excessively corroded (2.4.a.3) Nearside rear suspension spring mounting prescribed area is excessively corroded (2.4.a.3) 16 June 2016 [07:35] 16/06/2016 13 May 2013 [10:25] 13/05/2013 960382934875 960382934875 935453833137 935453833137
2 Nearside rear suspension spring mounting prescribed area is corroded but not considered excessive (2.4.a.3) Nearside rear suspension spring mounting prescribed area is corroded but not considered excessive (2.4.a.3) 11 June 2013 [13:49] 11/06/2013 18 May 2010 [15:17] 18/05/2010 536902063161 536902063161 721858130182 721858130182

ALL DJO 415D ADVISORIES [15]

ALL ADVISORIES, ORDERED by OCCURRENCE DURING DJO 415D's MOT HISTORY
ALL DJO 415D ADVISORIES [15]
ALL ADVISORIES, ORDERED by OCCURRENCE DURING DJO 415D's MOT HISTORY
Advisory Faults | source www.vehiclestats.co.uk
Fault Fault Test Date Test Date/Time Reference MOT Test Reference
2 Nearside front seat missing at time of test Nearside front seat missing at time of test 22 June 2017 [06:03] 22/06/2017 21 June 2017 [09:30] 21/06/2017 928638573766 928638573766 477123382760 477123382760
2 All four tyres starting to perish over tread pattern All four tyres starting to perish over tread pattern 22 June 2017 [06:03] 22/06/2017 21 June 2017 [09:30] 21/06/2017 928638573766 928638573766 477123382760 477123382760
2 Passenger front seat has been removed Passenger front seat has been removed 23 June 2016 [08:59] 23/06/2016 16 June 2016 [07:35] 16/06/2016 531127050994 531127050994 960382934875 960382934875
2 Slight drag on offside rear brake Slight drag on offside rear brake 23 June 2016 [08:59] 23/06/2016 16 June 2016 [07:35] 16/06/2016 531127050994 531127050994 960382934875 960382934875
2 Nearside rear suspension spring mounting prescribed area is corroded but not considered excessive (2.4.a.3) Nearside rear suspension spring mounting prescribed area is corroded but not considered excessive (2.4.a.3) 11 June 2013 [13:49] 11/06/2013 18 May 2010 [15:17] 18/05/2010 536902063161 536902063161 721858130182 721858130182
1 Offside front inner sill slight corrosion Offside front inner sill slight corrosion 21 June 2017 [09:30] 21/06/2017 477123382760 477123382760
1 Nearside front front wheel bearing has slight play (2.5.a.3c) Nearside front front wheel bearing has slight play (2.5.a.3c) 21 June 2017 [09:30] 21/06/2017 477123382760 477123382760
1 Offside rear suspension spring mounting prescribed area is corroded but not considered excessive (2.4.a.3) Offside rear suspension spring mounting prescribed area is corroded but not considered excessive (2.4.a.3) 11 June 2013 [13:49] 11/06/2013 536902063161 536902063161
1 Rear brake hose slightly deteriorated (3.6.b.4d) Rear brake hose slightly deteriorated (3.6.b.4d) 13 May 2013 [10:25] 13/05/2013 935453833137 935453833137
1 Offside rear suspension spring mounting prescribed area is distorted but not considered excessive (2.4.a.3) Offside rear suspension spring mounting prescribed area is distorted but not considered excessive (2.4.a.3) 18 May 2010 [15:17] 18/05/2010 721858130182 721858130182

ALL DJO 415D Failure Faults [9]

ALL Failure faults, ORDERED by OCCURRENCE DURING DJO 415D's MOT HISTORY
ALL DJO 415D Failure Faults [9]
ALL Failure faults, ORDERED by OCCURRENCE DURING DJO 415D's MOT HISTORY
Fail Faults | source www.vehiclestats.co.uk
Fault Fault Test Date Test Date/Time Reference MOT Test Reference
2 Nearside rear suspension spring mounting prescribed area is excessively corroded (2.4.a.3) Nearside rear suspension spring mounting prescribed area is excessively corroded (2.4.a.3) 16 June 2016 [07:35] 16/06/2016 13 May 2013 [10:25] 13/05/2013 960382934875 960382934875 935453833137 935453833137
1 Rear brakes imbalanced across an axle axle 2 (3.7.b.5b) Rear brakes imbalanced across an axle axle 2 (3.7.b.5b) 21 June 2017 [09:30] 21/06/2017 477123382760 477123382760
1 Nearside headlamp not working on dipped beam (1.7.5a) Nearside headlamp not working on dipped beam (1.7.5a) 16 June 2016 [07:35] 16/06/2016 960382934875 960382934875
1 Registration plate lamp not working (1.1.c.1d) Registration plate lamp not working (1.1.c.1d) 16 June 2016 [07:35] 16/06/2016 960382934875 960382934875
1 Nearside front wheel bearing rough when rotated (2.5.a.2) Nearside front wheel bearing rough when rotated (2.5.a.2) 16 June 2016 [07:35] 16/06/2016 960382934875 960382934875
1 Offside rear suspension spring mounting prescribed area is excessively corroded (2.4.a.3) Offside rear suspension spring mounting prescribed area is excessively corroded (2.4.a.3) 13 May 2013 [10:25] 13/05/2013 935453833137 935453833137
1 Nearside front brake hose excessively deteriorated (3.6.b.4d) Nearside front brake hose excessively deteriorated (3.6.b.4d) 13 May 2013 [10:25] 13/05/2013 935453833137 935453833137
1 Offside front brake hose excessively deteriorated (3.6.b.4d) Offside front brake hose excessively deteriorated (3.6.b.4d) 13 May 2013 [10:25] 13/05/2013 935453833137 935453833137

ALL DJO 415D User Entered Faults [5]

ALL User Entered faults, ORDERED by OCCURRENCE DURING DJO 415D's MOT HISTORY
ALL DJO 415D User Entered Faults [5]
ALL User Entered faults, ORDERED by OCCURRENCE DURING DJO 415D's MOT HISTORY
User Entered Faults | source www.vehiclestats.co.uk
Fault Fault Test Date Test Date/Time Reference MOT Test Reference
1 Slight perishing on all tyres. Slight perishing on all tyres. 28 May 2014 [09:48] 28/05/2014 198038144183 198038144183
1 Thick underbody seal on nsr and osr chassis members. Thick underbody seal on nsr and osr chassis members. 11 June 2013 [13:49] 11/06/2013 536902063161 536902063161
1 Nsr and osr spring shackles close to rear chassis members. Nsr and osr spring shackles close to rear chassis members. 11 June 2013 [13:49] 11/06/2013 536902063161 536902063161
1 Corrosion in n/s sill front . Corrosion in n/s sill front . 18 May 2010 [15:17] 18/05/2010 721858130182 721858130182
1 Corrosion in o/s sill front . Corrosion in o/s sill front . 18 May 2010 [15:17] 18/05/2010 721858130182 721858130182

MOT TEST: 22 June 2017 06:03:14 PASSED
MOT TEST: 22 June 2017 06:03:14 PASSED

This test (928638573766) was completed on the 22 June 2017 06:03:14 and PASSED the requirements for a valid MOT with 2 comments.

This test (928638573766) was completed on the 22 June 2017 06:03:14 and PASSED the requirements for a valid MOT with 2 comments.

Recorded mileage: 81,229

Recorded mileage: 81,229


ADVISORY


MOT TEST: 21 June 2017 09:30:41 FAILED
MOT TEST: 21 June 2017 09:30:41 FAILED

This test (477123382760) was completed on the 21 June 2017 09:30:41 and FAILED the requirements for a valid MOT with 5 comments.

This test (477123382760) was completed on the 21 June 2017 09:30:41 and FAILED the requirements for a valid MOT with 5 comments.

Recorded mileage: 81,229

Recorded mileage: 81,229


ADVISORY

FAIL


MOT TEST: 23 June 2016 08:59:33 PASSED
MOT TEST: 23 June 2016 08:59:33 PASSED

This test (531127050994) was completed on the 23 June 2016 08:59:33 and PASSED the requirements for a valid MOT with 2 comments.

This test (531127050994) was completed on the 23 June 2016 08:59:33 and PASSED the requirements for a valid MOT with 2 comments.

Recorded mileage: 79,472

Recorded mileage: 79,472


ADVISORY


MOT TEST: 16 June 2016 07:35:24 FAILED
MOT TEST: 16 June 2016 07:35:24 FAILED

This test (960382934875) was completed on the 16 June 2016 07:35:24 and FAILED the requirements for a valid MOT with 6 comments.

This test (960382934875) was completed on the 16 June 2016 07:35:24 and FAILED the requirements for a valid MOT with 6 comments.

Recorded mileage: 79,444

Recorded mileage: 79,444


ADVISORY

FAIL


MOT TEST: 14 May 2015 10:48:41 PASSED
MOT TEST: 14 May 2015 10:48:41 PASSED

This test (306434435194) was completed on the 14 May 2015 10:48:41 and PASSED the requirements for a valid MOT with 0 comments.

This test (306434435194) was completed on the 14 May 2015 10:48:41 and PASSED the requirements for a valid MOT with 0 comments.

Recorded mileage: 78,373

Recorded mileage: 78,373


MOT TEST: 28 May 2014 09:48:48 PASSED
MOT TEST: 28 May 2014 09:48:48 PASSED

This test (198038144183) was completed on the 28 May 2014 09:48:48 and PASSED the requirements for a valid MOT with 1 comments.

This test (198038144183) was completed on the 28 May 2014 09:48:48 and PASSED the requirements for a valid MOT with 1 comments.

Recorded mileage: 78,336

Recorded mileage: 78,336


USER ENTERED


MOT TEST: 11 June 2013 13:49:07 PASSED
MOT TEST: 11 June 2013 13:49:07 PASSED

This test (536902063161) was completed on the 11 June 2013 13:49:07 and PASSED the requirements for a valid MOT with 4 comments.

This test (536902063161) was completed on the 11 June 2013 13:49:07 and PASSED the requirements for a valid MOT with 4 comments.

Recorded mileage: 78,292

Recorded mileage: 78,292


ADVISORY

USER ENTERED


MOT TEST: 13 May 2013 10:25:14 FAILED
MOT TEST: 13 May 2013 10:25:14 FAILED

This test (935453833137) was completed on the 13 May 2013 10:25:14 and FAILED the requirements for a valid MOT with 5 comments.

This test (935453833137) was completed on the 13 May 2013 10:25:14 and FAILED the requirements for a valid MOT with 5 comments.

Recorded mileage: 78,237

Recorded mileage: 78,237


ADVISORY

FAIL


MOT TEST: 21 April 2012 09:44:10 PASSED
MOT TEST: 21 April 2012 09:44:10 PASSED

This test (476912712188) was completed on the 21 April 2012 09:44:10 and PASSED the requirements for a valid MOT with 0 comments.

This test (476912712188) was completed on the 21 April 2012 09:44:10 and PASSED the requirements for a valid MOT with 0 comments.

Recorded mileage: 78,027

Recorded mileage: 78,027


MOT TEST: 21 April 2011 15:07:07 PASSED
MOT TEST: 21 April 2011 15:07:07 PASSED

This test (169381411125) was completed on the 21 April 2011 15:07:07 and PASSED the requirements for a valid MOT with 0 comments.

This test (169381411125) was completed on the 21 April 2011 15:07:07 and PASSED the requirements for a valid MOT with 0 comments.

Recorded mileage: 77,711

Recorded mileage: 77,711


MOT TEST: 18 May 2010 15:17:44 PASSED
MOT TEST: 18 May 2010 15:17:44 PASSED

This test (721858130182) was completed on the 18 May 2010 15:17:44 and PASSED the requirements for a valid MOT with 4 comments.

This test (721858130182) was completed on the 18 May 2010 15:17:44 and PASSED the requirements for a valid MOT with 4 comments.

Recorded mileage: 77,551

Recorded mileage: 77,551


ADVISORY

USER ENTERED


MOT TEST: 06 May 2008 13:48:06 PASSED
MOT TEST: 06 May 2008 13:48:06 PASSED

This test (862897228127) was completed on the 06 May 2008 13:48:06 and PASSED the requirements for a valid MOT with 0 comments.

This test (862897228127) was completed on the 06 May 2008 13:48:06 and PASSED the requirements for a valid MOT with 0 comments.

Recorded mileage: 76,045

Recorded mileage: 76,045


MOT TEST: 16 May 2007 11:43:04 PASSED
MOT TEST: 16 May 2007 11:43:04 PASSED

This test (622606037172) was completed on the 16 May 2007 11:43:04 and PASSED the requirements for a valid MOT with 0 comments.

This test (622606037172) was completed on the 16 May 2007 11:43:04 and PASSED the requirements for a valid MOT with 0 comments.

Recorded mileage: 75,911

Recorded mileage: 75,911


MOT TEST: 05 June 2006 11:12:13 PASSED
MOT TEST: 05 June 2006 11:12:13 PASSED

This test (403946656102) was completed on the 05 June 2006 11:12:13 and PASSED the requirements for a valid MOT with 0 comments.

This test (403946656102) was completed on the 05 June 2006 11:12:13 and PASSED the requirements for a valid MOT with 0 comments.

Recorded mileage: 75,300

Recorded mileage: 75,300