DJO 581D


DJO581D is registered to a Grey 1966, Morris Minor 1000 with a Petrol engine. It Passed its most recent MOT Test on the 12 April 2018

37 unique faults (46 Total) reported in its MOT History (21 Tests).

9 common/recurring faults, the most frequent (2 times) is: some corrosion on offside floor outside prescribed areas.

62% (13) MOT Pass Rate and a 38% (8) MOT Failure Rate.

93,545 recorded miles.

DJO 581D


DJO581D is registered to a Grey 1966, Morris Minor 1000 with a Petrol engine. It Passed its most recent MOT Test on the 12 April 2018

37 unique faults (46 Total) reported in its MOT History (21 Tests).

9 common/recurring faults, the most frequent (2 times) is: some corrosion on offside floor outside prescribed areas.

62% (13) MOT Pass Rate and a 38% (8) MOT Failure Rate.

93,545 recorded miles.

MOT PASS/Failure rate for DJO 581D

all MOT test results for DJO 581D represented as a percentage
MOT PASS/Failure rate for DJO 581D
all MOT test results for DJO 581D represented as a percentage

PERCENTAGE OF VEHICLE FAULTS WITH DJO 581D

ALL REPORTED FAULTS, DISPLAYED BY PERCENTAGE OF OCCURRENCE DURING ALL MOT TESTS
PERCENTAGE OF VEHICLE FAULTS WITH DJO 581D
ALL REPORTED FAULTS, DISPLAYED BY PERCENTAGE OF OCCURRENCE DURING ALL MOT TESTS
ADVISORY

FAIL

USER ENTERED

DJO 581D annual Faults by type

ALL REPORTED FAULTS, DISPLAYED over time and categorised by type
DJO 581D annual Faults by type
ALL REPORTED FAULTS, DISPLAYED over time and categorised by type

RECURRING FAULTS WITH DJO 581D

FAULTS THAT HAVE OCCURED MORE THAN ONCE DURING DJO 581D's MOT HISTORY
RECURRING FAULTS WITH DJO 581D
FAULTS THAT HAVE OCCURED MORE THAN ONCE DURING DJO 581D's MOT HISTORY
Fault Fault Test Date Test Date/Time Reference MOT Test Reference
2 Some corrosion on offside floor outside prescribed areas Some corrosion on offside floor outside prescribed areas 18 April 2017 [16:07] 18/04/2017 06 April 2017 [16:45] 06/04/2017 977897948338 977897948338 583491217462 583491217462
2 Nearside track rod end ball joint has slight play (2.2.b.1f) Nearside track rod end ball joint has slight play (2.2.b.1f) 18 April 2017 [16:07] 18/04/2017 06 April 2017 [16:45] 06/04/2017 977897948338 977897948338 583491217462 583491217462
2 Brake pipe slightly corroded (3.6.b.2c) Brake pipe slightly corroded (3.6.b.2c) 26 March 2015 [10:40] 26/03/2015 23 March 2015 [17:04] 23/03/2015 336445085026 336445085026 445132085015 445132085015
2 Front brake pipe slightly corroded (3.6.b.2c) Front brake pipe slightly corroded (3.6.b.2c) 16 May 2014 [10:00] 16/05/2014 09 May 2014 [09:47] 09/05/2014 936586434198 936586434198 107449324127 107449324127
2 Off side lower suspension joint some play Off side lower suspension joint some play 16 May 2014 [10:00] 16/05/2014 09 May 2014 [09:47] 09/05/2014 936586434198 936586434198 107449324127 107449324127
2 Nearside front tyre worn close to the legal limit (4.1.e.1) Nearside front tyre worn close to the legal limit (4.1.e.1) 13 May 2013 [16:28] 13/05/2013 01 May 2013 [10:41] 01/05/2013 898363933147 898363933147 247791023449 247791023449
2 Horn not working (1.6.2a) Horn not working (1.6.2a) 01 May 2013 [10:41] 01/05/2013 17 April 2012 [08:22] 17/04/2012 247791023449 247791023449 469918802188 469918802188
2 Nearside upper suspension arm rubber bush deteriorated but not resulting in excessive movement (2.4.g.2) Nearside upper suspension arm rubber bush deteriorated but not resulting in excessive movement (2.4.g.2) 18 April 2012 [10:59] 18/04/2012 17 April 2012 [08:22] 17/04/2012 915009402136 915009402136 469918802188 469918802188
2 Front brake hose slightly deteriorated (3.6.b.4d) Front brake hose slightly deteriorated (3.6.b.4d) 18 April 2012 [10:59] 18/04/2012 17 April 2012 [08:22] 17/04/2012 915009402136 915009402136 469918802188 469918802188

ALL DJO 581D ADVISORIES [17]

ALL ADVISORIES, ORDERED by OCCURRENCE DURING DJO 581D's MOT HISTORY
ALL DJO 581D ADVISORIES [17]
ALL ADVISORIES, ORDERED by OCCURRENCE DURING DJO 581D's MOT HISTORY
Advisory Faults | source www.vehiclestats.co.uk
Fault Fault Test Date Test Date/Time Reference MOT Test Reference
2 Some corrosion on offside floor outside prescribed areas Some corrosion on offside floor outside prescribed areas 18 April 2017 [16:07] 18/04/2017 06 April 2017 [16:45] 06/04/2017 977897948338 977897948338 583491217462 583491217462
2 Nearside track rod end ball joint has slight play (2.2.b.1f) Nearside track rod end ball joint has slight play (2.2.b.1f) 18 April 2017 [16:07] 18/04/2017 06 April 2017 [16:45] 06/04/2017 977897948338 977897948338 583491217462 583491217462
2 Brake pipe slightly corroded (3.6.b.2c) Brake pipe slightly corroded (3.6.b.2c) 26 March 2015 [10:40] 26/03/2015 23 March 2015 [17:04] 23/03/2015 336445085026 336445085026 445132085015 445132085015
2 Front brake pipe slightly corroded (3.6.b.2c) Front brake pipe slightly corroded (3.6.b.2c) 16 May 2014 [10:00] 16/05/2014 09 May 2014 [09:47] 09/05/2014 936586434198 936586434198 107449324127 107449324127
2 Nearside front tyre worn close to the legal limit (4.1.e.1) Nearside front tyre worn close to the legal limit (4.1.e.1) 13 May 2013 [16:28] 13/05/2013 01 May 2013 [10:41] 01/05/2013 898363933147 898363933147 247791023449 247791023449
2 Nearside upper suspension arm rubber bush deteriorated but not resulting in excessive movement (2.4.g.2) Nearside upper suspension arm rubber bush deteriorated but not resulting in excessive movement (2.4.g.2) 18 April 2012 [10:59] 18/04/2012 17 April 2012 [08:22] 17/04/2012 915009402136 915009402136 469918802188 469918802188
2 Front brake hose slightly deteriorated (3.6.b.4d) Front brake hose slightly deteriorated (3.6.b.4d) 18 April 2012 [10:59] 18/04/2012 17 April 2012 [08:22] 17/04/2012 915009402136 915009402136 469918802188 469918802188
1 Offside front front wheel bearing has slight play (2.5.a.3c) Offside front front wheel bearing has slight play (2.5.a.3c) 23 March 2015 [17:04] 23/03/2015 445132085015 445132085015
1 Offside front brake hose slightly deteriorated (3.6.b.4d) Offside front brake hose slightly deteriorated (3.6.b.4d) 01 May 2013 [10:41] 01/05/2013 247791023449 247791023449
1 Nearside front shock absorber has a slightly worn linkage (2.7.4) Nearside front shock absorber has a slightly worn linkage (2.7.4) 28 April 2010 [13:07] 28/04/2010 210858710477 210858710477

ALL DJO 581D Failure Faults [26]

ALL Failure faults, ORDERED by OCCURRENCE DURING DJO 581D's MOT HISTORY
ALL DJO 581D Failure Faults [26]
ALL Failure faults, ORDERED by OCCURRENCE DURING DJO 581D's MOT HISTORY
Fail Faults | source www.vehiclestats.co.uk
Fault Fault Test Date Test Date/Time Reference MOT Test Reference
2 Horn not working (1.6.2a) Horn not working (1.6.2a) 01 May 2013 [10:41] 01/05/2013 17 April 2012 [08:22] 17/04/2012 247791023449 247791023449 469918802188 469918802188
1 Offside headlamp adversely affected by the operation of another lamp (1.7.5c) Offside headlamp adversely affected by the operation of another lamp (1.7.5c) 06 April 2017 [16:45] 06/04/2017 583491217462 583491217462
1 Nearside headlamp aim too low (1.8) Nearside headlamp aim too low (1.8) 06 April 2017 [16:45] 06/04/2017 583491217462 583491217462
1 Offside registration plate lamp not working (1.1.c.1d) Offside registration plate lamp not working (1.1.c.1d) 06 April 2017 [16:45] 06/04/2017 583491217462 583491217462
1 Offside rear leaf spring fractured (2.4.b.1a) Offside rear leaf spring fractured (2.4.b.1a) 06 April 2017 [16:45] 06/04/2017 583491217462 583491217462
1 Offside rear suspension spring mounting prescribed area is inadequately repaired at shackle end (2.4.a.3) Offside rear suspension spring mounting prescribed area is inadequately repaired at shackle end (2.4.a.3) 06 April 2017 [16:45] 06/04/2017 583491217462 583491217462
1 Nearside rear suspension spring mounting prescribed area is excessively corroded floor area (2.4.a.3) Nearside rear suspension spring mounting prescribed area is excessively corroded floor area (2.4.a.3) 06 April 2017 [16:45] 06/04/2017 583491217462 583491217462
1 Nearside headlamp aim too low and too far to the left. (1.8) Nearside headlamp aim too low and too far to the left. (1.8) 23 March 2015 [17:04] 23/03/2015 445132085015 445132085015
1 Offside headlamp aim too low and too far to the left. (1.8) Offside headlamp aim too low and too far to the left. (1.8) 23 March 2015 [17:04] 23/03/2015 445132085015 445132085015
1 Offside headlamp insecure (1.7.3) Offside headlamp insecure (1.7.3) 23 March 2015 [17:04] 23/03/2015 445132085015 445132085015
1 Nearside front front position lamp(s) not working (1.1.a.3b) Nearside front front position lamp(s) not working (1.1.a.3b) 09 May 2014 [09:47] 09/05/2014 107449324127 107449324127
1 Exhaust has a major leak of exhaust gases (7.1.2) Exhaust has a major leak of exhaust gases (7.1.2) 09 May 2014 [09:47] 09/05/2014 107449324127 107449324127
1 Centre registration plate lamp not working (1.1.c.1d) Centre registration plate lamp not working (1.1.c.1d) 01 May 2013 [10:41] 01/05/2013 247791023449 247791023449
1 Nearside windscreen washer provides insufficient washer liquid (8.2.3) Nearside windscreen washer provides insufficient washer liquid (8.2.3) 01 May 2013 [10:41] 01/05/2013 247791023449 247791023449
1 Offside rear suspension spring mounting prescribed area is excessively corroded (2.4.a.3) Offside rear suspension spring mounting prescribed area is excessively corroded (2.4.a.3) 01 May 2013 [10:41] 01/05/2013 247791023449 247791023449
1 Nearside front upper suspension arm rubber bush deteriorated resulting in excessive movement (2.4.g.2) Nearside front upper suspension arm rubber bush deteriorated resulting in excessive movement (2.4.g.2) 01 May 2013 [10:41] 01/05/2013 247791023449 247791023449
1 Offside front front position lamp(s) not working (1.1.a.3b) Offside front front position lamp(s) not working (1.1.a.3b) 13 May 2011 [09:12] 13/05/2011 625143231135 625143231135
1 Nearside front direction indicators adversely affected by the operation of another lamp (1.4.a.2h) Nearside front direction indicators adversely affected by the operation of another lamp (1.4.a.2h) 13 May 2011 [09:12] 13/05/2011 625143231135 625143231135
1 Nearside rear direction indicators adversely affected by the operation of another lamp (1.4.a.2h) Nearside rear direction indicators adversely affected by the operation of another lamp (1.4.a.2h) 13 May 2011 [09:12] 13/05/2011 625143231135 625143231135
1 Parking brake: efficiency below requirements (3.7.b.7) Parking brake: efficiency below requirements (3.7.b.7) 13 May 2011 [09:12] 13/05/2011 625143231135 625143231135
1 Offside registration plate lamp not working (1.1.5c) Offside registration plate lamp not working (1.1.5c) 29 March 2007 [09:37] 29/03/2007 140698387008 140698387008
1 Offside steering rack gaiter split (2.2.d.2d) Offside steering rack gaiter split (2.2.d.2d) 29 March 2007 [09:37] 29/03/2007 140698387008 140698387008
1 Nearside steering rack gaiter insecure (2.2.d.2d) Nearside steering rack gaiter insecure (2.2.d.2d) 29 March 2007 [09:37] 29/03/2007 140698387008 140698387008
1 Brakes imbalanced across an axle (3.7.b.5b) Brakes imbalanced across an axle (3.7.b.5b) 29 March 2007 [09:37] 29/03/2007 140698387008 140698387008
1 Nearside rear suspension spring mounting prescribed area is excessively corroded (2.4.a.3) Nearside rear suspension spring mounting prescribed area is excessively corroded (2.4.a.3) 28 February 2006 [13:53] 28/02/2006 124889056421 124889056421

ALL DJO 581D User Entered Faults [3]

ALL User Entered faults, ORDERED by OCCURRENCE DURING DJO 581D's MOT HISTORY
ALL DJO 581D User Entered Faults [3]
ALL User Entered faults, ORDERED by OCCURRENCE DURING DJO 581D's MOT HISTORY
Advisory Faults | source www.vehiclestats.co.uk
Fault Fault Test Date Test Date/Time Reference MOT Test Reference
2 Off side lower suspension joint some play Off side lower suspension joint some play 16 May 2014 [10:00] 16/05/2014 09 May 2014 [09:47] 09/05/2014 936586434198 936586434198 107449324127 107449324127
1 Suspension bushes splitting †n/s/f brake hose slightly twisted Suspension bushes splitting †n/s/f brake hose slightly twisted 29 March 2007 [09:37] 29/03/2007 140698387008 140698387008

MOT TEST: 12 April 2018 11:20:18 PASSED
MOT TEST: 12 April 2018 11:20:18 PASSED

This test (985766532911) was completed on the 12 April 2018 11:20:18 and PASSED the requirements for a valid MOT with 0 comments.

This test (985766532911) was completed on the 12 April 2018 11:20:18 and PASSED the requirements for a valid MOT with 0 comments.

Recorded mileage: 93,545

Recorded mileage: 93,545


MOT TEST: 18 April 2017 16:07:03 PASSED
MOT TEST: 18 April 2017 16:07:03 PASSED

This test (977897948338) was completed on the 18 April 2017 16:07:03 and PASSED the requirements for a valid MOT with 2 comments.

This test (977897948338) was completed on the 18 April 2017 16:07:03 and PASSED the requirements for a valid MOT with 2 comments.

Recorded mileage: 90,704

Recorded mileage: 90,704


ADVISORY


MOT TEST: 06 April 2017 16:45:14 FAILED
MOT TEST: 06 April 2017 16:45:14 FAILED

This test (583491217462) was completed on the 06 April 2017 16:45:14 and FAILED the requirements for a valid MOT with 8 comments.

This test (583491217462) was completed on the 06 April 2017 16:45:14 and FAILED the requirements for a valid MOT with 8 comments.

Recorded mileage: 90,631

Recorded mileage: 90,631


ADVISORY

FAIL


MOT TEST: 14 April 2016 11:56:40 PASSED
MOT TEST: 14 April 2016 11:56:40 PASSED

This test (830808645730) was completed on the 14 April 2016 11:56:40 and PASSED the requirements for a valid MOT with 0 comments.

This test (830808645730) was completed on the 14 April 2016 11:56:40 and PASSED the requirements for a valid MOT with 0 comments.

Recorded mileage: 88,574

Recorded mileage: 88,574


MOT TEST: 26 March 2015 10:40:31 PASSED
MOT TEST: 26 March 2015 10:40:31 PASSED

This test (336445085026) was completed on the 26 March 2015 10:40:31 and PASSED the requirements for a valid MOT with 1 comments.

This test (336445085026) was completed on the 26 March 2015 10:40:31 and PASSED the requirements for a valid MOT with 1 comments.

Recorded mileage: 82,102

Recorded mileage: 82,102


ADVISORY


MOT TEST: 23 March 2015 17:04:37 FAILED
MOT TEST: 23 March 2015 17:04:37 FAILED

This test (445132085015) was completed on the 23 March 2015 17:04:37 and FAILED the requirements for a valid MOT with 5 comments.

This test (445132085015) was completed on the 23 March 2015 17:04:37 and FAILED the requirements for a valid MOT with 5 comments.

Recorded mileage: 82,012

Recorded mileage: 82,012


ADVISORY

FAIL


MOT TEST: 16 May 2014 10:00:33 PASSED
MOT TEST: 16 May 2014 10:00:33 PASSED

This test (936586434198) was completed on the 16 May 2014 10:00:33 and PASSED the requirements for a valid MOT with 2 comments.

This test (936586434198) was completed on the 16 May 2014 10:00:33 and PASSED the requirements for a valid MOT with 2 comments.

Recorded mileage: 81,710

Recorded mileage: 81,710


ADVISORY

USER ENTERED


MOT TEST: 09 May 2014 09:47:56 FAILED
MOT TEST: 09 May 2014 09:47:56 FAILED

This test (107449324127) was completed on the 09 May 2014 09:47:56 and FAILED the requirements for a valid MOT with 4 comments.

This test (107449324127) was completed on the 09 May 2014 09:47:56 and FAILED the requirements for a valid MOT with 4 comments.

Recorded mileage: 81,572

Recorded mileage: 81,572


ADVISORY

FAIL

USER ENTERED


MOT TEST: 13 May 2013 16:28:18 PASSED
MOT TEST: 13 May 2013 16:28:18 PASSED

This test (898363933147) was completed on the 13 May 2013 16:28:18 and PASSED the requirements for a valid MOT with 1 comments.

This test (898363933147) was completed on the 13 May 2013 16:28:18 and PASSED the requirements for a valid MOT with 1 comments.

Recorded mileage: 80,716

Recorded mileage: 80,716


ADVISORY


MOT TEST: 01 May 2013 10:41:52 FAILED
MOT TEST: 01 May 2013 10:41:52 FAILED

This test (247791023449) was completed on the 01 May 2013 10:41:52 and FAILED the requirements for a valid MOT with 7 comments.

This test (247791023449) was completed on the 01 May 2013 10:41:52 and FAILED the requirements for a valid MOT with 7 comments.

Recorded mileage: 80,689

Recorded mileage: 80,689


ADVISORY

FAIL


MOT TEST: 18 April 2012 10:59:10 PASSED
MOT TEST: 18 April 2012 10:59:10 PASSED

This test (915009402136) was completed on the 18 April 2012 10:59:10 and PASSED the requirements for a valid MOT with 2 comments.

This test (915009402136) was completed on the 18 April 2012 10:59:10 and PASSED the requirements for a valid MOT with 2 comments.

Recorded mileage: 79,062

Recorded mileage: 79,062


ADVISORY


MOT TEST: 17 April 2012 08:22:48 FAILED
MOT TEST: 17 April 2012 08:22:48 FAILED

This test (469918802188) was completed on the 17 April 2012 08:22:48 and FAILED the requirements for a valid MOT with 3 comments.

This test (469918802188) was completed on the 17 April 2012 08:22:48 and FAILED the requirements for a valid MOT with 3 comments.

Recorded mileage: 79,056

Recorded mileage: 79,056


ADVISORY

FAIL


MOT TEST: 17 May 2011 10:26:53 PASSED
MOT TEST: 17 May 2011 10:26:53 PASSED

This test (267527331451) was completed on the 17 May 2011 10:26:53 and PASSED the requirements for a valid MOT with 0 comments.

This test (267527331451) was completed on the 17 May 2011 10:26:53 and PASSED the requirements for a valid MOT with 0 comments.

Recorded mileage: 77,373

Recorded mileage: 77,373


MOT TEST: 13 May 2011 09:12:31 FAILED
MOT TEST: 13 May 2011 09:12:31 FAILED

This test (625143231135) was completed on the 13 May 2011 09:12:31 and FAILED the requirements for a valid MOT with 4 comments.

This test (625143231135) was completed on the 13 May 2011 09:12:31 and FAILED the requirements for a valid MOT with 4 comments.

Recorded mileage: 77,366

Recorded mileage: 77,366


FAIL


MOT TEST: 28 April 2010 13:07:31 PASSED
MOT TEST: 28 April 2010 13:07:31 PASSED

This test (210858710477) was completed on the 28 April 2010 13:07:31 and PASSED the requirements for a valid MOT with 1 comments.

This test (210858710477) was completed on the 28 April 2010 13:07:31 and PASSED the requirements for a valid MOT with 1 comments.

Recorded mileage: 75,296

Recorded mileage: 75,296


ADVISORY


MOT TEST: 30 April 2009 13:07:24 PASSED
MOT TEST: 30 April 2009 13:07:24 PASSED

This test (830460429156) was completed on the 30 April 2009 13:07:24 and PASSED the requirements for a valid MOT with 0 comments.

This test (830460429156) was completed on the 30 April 2009 13:07:24 and PASSED the requirements for a valid MOT with 0 comments.

Recorded mileage: 73,717

Recorded mileage: 73,717


MOT TEST: 08 May 2008 13:33:17 PASSED
MOT TEST: 08 May 2008 13:33:17 PASSED

This test (281789828412) was completed on the 08 May 2008 13:33:17 and PASSED the requirements for a valid MOT with 0 comments.

This test (281789828412) was completed on the 08 May 2008 13:33:17 and PASSED the requirements for a valid MOT with 0 comments.

Recorded mileage: 72,025

Recorded mileage: 72,025


MOT TEST: 12 April 2007 08:15:00 PASSED
MOT TEST: 12 April 2007 08:15:00 PASSED

This test (472022907122) was completed on the 12 April 2007 08:15:00 and PASSED the requirements for a valid MOT with 0 comments.

This test (472022907122) was completed on the 12 April 2007 08:15:00 and PASSED the requirements for a valid MOT with 0 comments.

Recorded mileage: 70,762

Recorded mileage: 70,762


MOT TEST: 29 March 2007 09:37:43 FAILED
MOT TEST: 29 March 2007 09:37:43 FAILED

This test (140698387008) was completed on the 29 March 2007 09:37:43 and FAILED the requirements for a valid MOT with 5 comments.

This test (140698387008) was completed on the 29 March 2007 09:37:43 and FAILED the requirements for a valid MOT with 5 comments.

Recorded mileage: 70,753

Recorded mileage: 70,753


FAIL

USER ENTERED


MOT TEST: 01 March 2006 14:33:49 PASSED
MOT TEST: 01 March 2006 14:33:49 PASSED

This test (194390866417) was completed on the 01 March 2006 14:33:49 and PASSED the requirements for a valid MOT with 0 comments.

This test (194390866417) was completed on the 01 March 2006 14:33:49 and PASSED the requirements for a valid MOT with 0 comments.

Recorded mileage: 69,209

Recorded mileage: 69,209


MOT TEST: 28 February 2006 13:53:50 FAILED
MOT TEST: 28 February 2006 13:53:50 FAILED

This test (124889056421) was completed on the 28 February 2006 13:53:50 and FAILED the requirements for a valid MOT with 1 comments.

This test (124889056421) was completed on the 28 February 2006 13:53:50 and FAILED the requirements for a valid MOT with 1 comments.

Recorded mileage: 69,209

Recorded mileage: 69,209


FAIL