DRO 334F


DRO334F is registered to a Blue 1968, Morris Minor traveller with a Petrol engine. It Passed its most recent MOT Test on the 29 May 2018

44 unique faults (55 Total) reported in its MOT History (22 Tests).

8 common/recurring faults, the most frequent (3 times) is: Front Windscreen washer provides insufficient washer liquid (8.2.3).

59% (13) MOT Pass Rate and a 41% (9) MOT Failure Rate.

69,838 recorded miles.

DRO 334F


DRO334F is registered to a Blue 1968, Morris Minor traveller with a Petrol engine. It Passed its most recent MOT Test on the 29 May 2018

44 unique faults (55 Total) reported in its MOT History (22 Tests).

8 common/recurring faults, the most frequent (3 times) is: Front Windscreen washer provides insufficient washer liquid (8.2.3).

59% (13) MOT Pass Rate and a 41% (9) MOT Failure Rate.

69,838 recorded miles.

MOT PASS/Failure rate for DRO 334F

all MOT test results for DRO 334F represented as a percentage
MOT PASS/Failure rate for DRO 334F
all MOT test results for DRO 334F represented as a percentage

PERCENTAGE OF VEHICLE FAULTS WITH DRO 334F

ALL REPORTED FAULTS, DISPLAYED BY PERCENTAGE OF OCCURRENCE DURING ALL MOT TESTS
PERCENTAGE OF VEHICLE FAULTS WITH DRO 334F
ALL REPORTED FAULTS, DISPLAYED BY PERCENTAGE OF OCCURRENCE DURING ALL MOT TESTS
ADVISORY

FAIL

USER ENTERED

PASS WITH RECTIFICATION

DRO 334F annual Faults by type

ALL REPORTED FAULTS, DISPLAYED over time and categorised by type
DRO 334F annual Faults by type
ALL REPORTED FAULTS, DISPLAYED over time and categorised by type

RECURRING FAULTS WITH DRO 334F

FAULTS THAT HAVE OCCURED MORE THAN ONCE DURING DRO 334F's MOT HISTORY
RECURRING FAULTS WITH DRO 334F
FAULTS THAT HAVE OCCURED MORE THAN ONCE DURING DRO 334F's MOT HISTORY
Fault Fault Test Date Test Date/Time Reference MOT Test Reference
3 Front windscreen washer provides insufficient washer liquid (8.2.3) Front windscreen washer provides insufficient washer liquid (8.2.3) 23 May 2011 [17:27] 23/05/2011 19 May 2010 [08:41] 19/05/2010 02 April 2009 [12:54] 02/04/2009 477843141104 477843141104 304139630137 304139630137 860642599072 860642599072
2 Horn not working (1.6.2a) Horn not working (1.6.2a) 24 May 2016 [09:19] 24/05/2016 02 April 2009 [12:54] 02/04/2009 100855873081 100855873081 860642599072 860642599072
2 Offside front tyre worn close to the legal limit (4.1.e.1) Offside front tyre worn close to the legal limit (4.1.e.1) 04 June 2014 [13:58] 04/06/2014 27 May 2014 [12:14] 27/05/2014 439945554152 439945554152 176827944183 176827944183
2 Nearside steering rack gaiter split (2.2.d.2d) Nearside steering rack gaiter split (2.2.d.2d) 27 May 2014 [12:14] 27/05/2014 25 May 2006 [09:50] 25/05/2006 176827944183 176827944183 434795946168 434795946168
2 Brake pedal spongy (3.3.b.1b) Brake pedal spongy (3.3.b.1b) 27 May 2014 [12:14] 27/05/2014 02 April 2009 [12:54] 02/04/2009 176827944183 176827944183 860642599072 860642599072
2 Front brake application uneven (3.7.b.2) Front brake application uneven (3.7.b.2) 15 May 2013 [15:44] 15/05/2013 19 May 2010 [08:41] 19/05/2010 218515133162 218515133162 304139630137 304139630137
2 Offside rear brake recording little or no effort (3.7.b.5a) Offside rear brake recording little or no effort (3.7.b.5a) 23 May 2011 [17:27] 23/05/2011 19 May 2010 [08:41] 19/05/2010 477843141104 477843141104 304139630137 304139630137
2 Parking brake: efficiency below requirements (3.7.c.1b) Parking brake: efficiency below requirements (3.7.c.1b) 23 May 2011 [17:27] 23/05/2011 02 April 2009 [12:54] 02/04/2009 477843141104 477843141104 860642599072 860642599072

ALL DRO 334F ADVISORIES [4]

ALL ADVISORIES, ORDERED by OCCURRENCE DURING DRO 334F's MOT HISTORY
ALL DRO 334F ADVISORIES [4]
ALL ADVISORIES, ORDERED by OCCURRENCE DURING DRO 334F's MOT HISTORY
Advisory Faults | source www.vehiclestats.co.uk
Fault Fault Test Date Test Date/Time Reference MOT Test Reference
2 Offside front tyre worn close to the legal limit (4.1.e.1) Offside front tyre worn close to the legal limit (4.1.e.1) 04 June 2014 [13:58] 04/06/2014 27 May 2014 [12:14] 27/05/2014 439945554152 439945554152 176827944183 176827944183
1 Offside front wheel bearing has slight play (2.5.a.3c) Offside front wheel bearing has slight play (2.5.a.3c) 27 May 2014 [12:14] 27/05/2014 176827944183 176827944183
1 Offside rear shock absorber has a light misting of oil (2.7.3) Offside rear shock absorber has a light misting of oil (2.7.3) 22 May 2008 [08:55] 22/05/2008 541033348111 541033348111

ALL DRO 334F Failure Faults [48]

ALL Failure faults, ORDERED by OCCURRENCE DURING DRO 334F's MOT HISTORY
ALL DRO 334F Failure Faults [48]
ALL Failure faults, ORDERED by OCCURRENCE DURING DRO 334F's MOT HISTORY
Fail Faults | source www.vehiclestats.co.uk
Fault Fault Test Date Test Date/Time Reference MOT Test Reference
3 Front windscreen washer provides insufficient washer liquid (8.2.3) Front windscreen washer provides insufficient washer liquid (8.2.3) 23 May 2011 [17:27] 23/05/2011 19 May 2010 [08:41] 19/05/2010 02 April 2009 [12:54] 02/04/2009 477843141104 477843141104 304139630137 304139630137 860642599072 860642599072
2 Nearside steering rack gaiter split (2.2.d.2d) Nearside steering rack gaiter split (2.2.d.2d) 27 May 2014 [12:14] 27/05/2014 25 May 2006 [09:50] 25/05/2006 176827944183 176827944183 434795946168 434795946168
2 Brake pedal spongy (3.3.b.1b) Brake pedal spongy (3.3.b.1b) 27 May 2014 [12:14] 27/05/2014 02 April 2009 [12:54] 02/04/2009 176827944183 176827944183 860642599072 860642599072
2 Front brake application uneven (3.7.b.2) Front brake application uneven (3.7.b.2) 15 May 2013 [15:44] 15/05/2013 19 May 2010 [08:41] 19/05/2010 218515133162 218515133162 304139630137 304139630137
2 Offside rear brake recording little or no effort (3.7.b.5a) Offside rear brake recording little or no effort (3.7.b.5a) 23 May 2011 [17:27] 23/05/2011 19 May 2010 [08:41] 19/05/2010 477843141104 477843141104 304139630137 304139630137
2 Parking brake: efficiency below requirements (3.7.c.1b) Parking brake: efficiency below requirements (3.7.c.1b) 23 May 2011 [17:27] 23/05/2011 02 April 2009 [12:54] 02/04/2009 477843141104 477843141104 860642599072 860642599072
1 Offside rear suspension component mounting prescribed area is excessively corroded (2.4.a.3) Offside rear suspension component mounting prescribed area is excessively corroded (2.4.a.3) 27 May 2014 [12:14] 27/05/2014 176827944183 176827944183
1 Nearside rear suspension component mounting prescribed area is excessively corroded (2.4.a.3) Nearside rear suspension component mounting prescribed area is excessively corroded (2.4.a.3) 27 May 2014 [12:14] 27/05/2014 176827944183 176827944183
1 Nearside front tie bar/rod rubber bush deteriorated resulting in excessive movement (2.4.g.2) Nearside front tie bar/rod rubber bush deteriorated resulting in excessive movement (2.4.g.2) 27 May 2014 [12:14] 27/05/2014 176827944183 176827944183
1 Nearside front brake hose excessively deteriorated (3.6.b.4d) Nearside front brake hose excessively deteriorated (3.6.b.4d) 27 May 2014 [12:14] 27/05/2014 176827944183 176827944183
1 Offside headlamp not working on dipped beam (1.7.5a) Offside headlamp not working on dipped beam (1.7.5a) 15 May 2013 [15:44] 15/05/2013 218515133162 218515133162
1 Offside registration plate lamp not working (1.1.c.1d) Offside registration plate lamp not working (1.1.c.1d) 15 May 2013 [15:44] 15/05/2013 218515133162 218515133162
1 Nearside windscreen wiper does not clear the windscreen effectively (8.2.2) Nearside windscreen wiper does not clear the windscreen effectively (8.2.2) 15 May 2013 [15:44] 15/05/2013 218515133162 218515133162
1 All position lamps not working (1.1.a.3b) All position lamps not working (1.1.a.3b) 25 May 2012 [14:48] 25/05/2012 356136142173 356136142173
1 Nearside front upper suspension arm rubber bush deteriorated resulting in excessive movement (2.4.g.2) Nearside front upper suspension arm rubber bush deteriorated resulting in excessive movement (2.4.g.2) 23 May 2011 [17:27] 23/05/2011 477843141104 477843141104
1 Offside front upper suspension arm rubber bush deteriorated resulting in excessive movement (2.4.g.2) Offside front upper suspension arm rubber bush deteriorated resulting in excessive movement (2.4.g.2) 23 May 2011 [17:27] 23/05/2011 477843141104 477843141104
1 Exhaust system not adequately supported (7.1.1) Exhaust system not adequately supported (7.1.1) 23 May 2011 [17:27] 23/05/2011 477843141104 477843141104
1 Service brake: efficiency below requirements (3.7.c.1a) Service brake: efficiency below requirements (3.7.c.1a) 23 May 2011 [17:27] 23/05/2011 477843141104 477843141104
1 Offside rear parking brake recording little or no effort (3.7.b.6a) Offside rear parking brake recording little or no effort (3.7.b.6a) 19 May 2010 [08:41] 19/05/2010 304139630137 304139630137
1 Offside rear brake binding (3.7.b.1) Offside rear brake binding (3.7.b.1) 19 May 2010 [08:41] 19/05/2010 304139630137 304139630137
1 Nearside rear leaf spring has excessive wear in a shackle pin and/or bush (2.4.b.2) Nearside rear leaf spring has excessive wear in a shackle pin and/or bush (2.4.b.2) 19 May 2010 [08:41] 19/05/2010 304139630137 304139630137
1 Offside rear leaf spring has excessive wear in a shackle pin and/or bush (2.4.b.2) Offside rear leaf spring has excessive wear in a shackle pin and/or bush (2.4.b.2) 19 May 2010 [08:41] 19/05/2010 304139630137 304139630137
1 Service brake: efficiency below requirements (3.7.b.7) Service brake: efficiency below requirements (3.7.b.7) 19 May 2010 [08:41] 19/05/2010 304139630137 304139630137
1 Parking brake: efficiency below requirements (3.7.b.7) Parking brake: efficiency below requirements (3.7.b.7) 19 May 2010 [08:41] 19/05/2010 304139630137 304139630137
1 Horn not working (1.6.2a) Horn not working (1.6.2a) 02 April 2009 [12:54] 02/04/2009 860642599072 860642599072
1 Front front brake application uneven (3.7.b.2) Front front brake application uneven (3.7.b.2) 02 April 2009 [12:54] 02/04/2009 860642599072 860642599072
1 Nearside rear brake recording little or no effort (3.7.b.5a) Nearside rear brake recording little or no effort (3.7.b.5a) 02 April 2009 [12:54] 02/04/2009 860642599072 860642599072
1 Nearside rear parking brake recording little or no effort (3.7.b.6a) Nearside rear parking brake recording little or no effort (3.7.b.6a) 02 April 2009 [12:54] 02/04/2009 860642599072 860642599072
1 Offside headlamp not working on main beam (1.7.5a) Offside headlamp not working on main beam (1.7.5a) 02 April 2009 [12:54] 02/04/2009 860642599072 860642599072
1 Offside rear position lamp(s) insecure (1.1.a.3a) Offside rear position lamp(s) insecure (1.1.a.3a) 02 April 2009 [12:54] 02/04/2009 860642599072 860642599072
1 Nearside front suspension has excessive play in a lower suspension ball joint (2.5.b.1a) Nearside front suspension has excessive play in a lower suspension ball joint (2.5.b.1a) 02 April 2009 [12:54] 02/04/2009 860642599072 860642599072
1 Offside rear shock absorber has negligible damping effect (2.7.5) Offside rear shock absorber has negligible damping effect (2.7.5) 02 April 2009 [12:54] 02/04/2009 860642599072 860642599072
1 Offside rear suspension spring mounting prescribed area is excessively corroded (2.4.a.3) Offside rear suspension spring mounting prescribed area is excessively corroded (2.4.a.3) 23 May 2007 [09:57] 23/05/2007 480953347113 480953347113
1 Nearside rear suspension spring mounting prescribed area is excessively corroded (2.4.a.3) Nearside rear suspension spring mounting prescribed area is excessively corroded (2.4.a.3) 23 May 2007 [09:57] 23/05/2007 480953347113 480953347113
1 Nearside front suspension component mounting prescribed area is excessively corroded (2.4.a.3) Nearside front suspension component mounting prescribed area is excessively corroded (2.4.a.3) 23 May 2007 [09:57] 23/05/2007 480953347113 480953347113
1 Offside rear shock absorber has a serious fluid leak (2.7.3) Offside rear shock absorber has a serious fluid leak (2.7.3) 23 May 2007 [09:57] 23/05/2007 480953347113 480953347113
1 Offside front upper torque/reaction arm has a deteriorated synthetic bush resulting in excessive movement (2.4.g.2) Offside front upper torque/reaction arm has a deteriorated synthetic bush resulting in excessive movement (2.4.g.2) 23 May 2007 [09:57] 23/05/2007 480953347113 480953347113
1 Offside front suspension component mounting prescribed area is excessively corroded (2.4.a.3) Offside front suspension component mounting prescribed area is excessively corroded (2.4.a.3) 25 May 2006 [09:50] 25/05/2006 434795946168 434795946168
1 Offside front front wheel bearing has excessive play (2.5.a.3c) Offside front front wheel bearing has excessive play (2.5.a.3c) 25 May 2006 [09:50] 25/05/2006 434795946168 434795946168

ALL DRO 334F User Entered Faults [2]

ALL User Entered faults, ORDERED by OCCURRENCE DURING DRO 334F's MOT HISTORY
ALL DRO 334F User Entered Faults [2]
ALL User Entered faults, ORDERED by OCCURRENCE DURING DRO 334F's MOT HISTORY
Fail Faults | source www.vehiclestats.co.uk
Fault Fault Test Date Test Date/Time Reference MOT Test Reference
1 Water pump u/s Water pump u/s 15 May 2013 [15:44] 15/05/2013 218515133162 218515133162
1 Suspect oil filter leaking Suspect oil filter leaking 02 April 2009 [12:54] 02/04/2009 860642599072 860642599072

ALL DRO 334F Pass With Rectification Faults [1]

ALL Pass With Rectification faults, ORDERED by OCCURRENCE DURING DRO 334F's MOT HISTORY
ALL DRO 334F Pass With Rectification Faults [1]
ALL Pass With Rectification faults, ORDERED by OCCURRENCE DURING DRO 334F's MOT HISTORY
Pass With Rectification Faults | source www.vehiclestats.co.uk
Fault Fault Test Date Test Date/Time Reference MOT Test Reference
1 Horn not working (1.6.2a) Horn not working (1.6.2a) 24 May 2016 [09:19] 24/05/2016 100855873081 100855873081

MOT TEST: 29 May 2018 14:31:36 PASSED
MOT TEST: 29 May 2018 14:31:36 PASSED

This test (390838123344) was completed on the 29 May 2018 14:31:36 and PASSED the requirements for a valid MOT with 0 comments.

This test (390838123344) was completed on the 29 May 2018 14:31:36 and PASSED the requirements for a valid MOT with 0 comments.

Recorded mileage: 69,838

Recorded mileage: 69,838


MOT TEST: 24 May 2017 10:12:58 PASSED
MOT TEST: 24 May 2017 10:12:58 PASSED

This test (169390559678) was completed on the 24 May 2017 10:12:58 and PASSED the requirements for a valid MOT with 0 comments.

This test (169390559678) was completed on the 24 May 2017 10:12:58 and PASSED the requirements for a valid MOT with 0 comments.

Recorded mileage: 69,648

Recorded mileage: 69,648


MOT TEST: 24 May 2016 09:19:34 PASSED
MOT TEST: 24 May 2016 09:19:34 PASSED

This test (481025909262) was completed on the 24 May 2016 09:19:34 and PASSED the requirements for a valid MOT with 0 comments.

This test (481025909262) was completed on the 24 May 2016 09:19:34 and PASSED the requirements for a valid MOT with 0 comments.

Recorded mileage: 69,512

Recorded mileage: 69,512


MOT TEST: 24 May 2016 09:19:33 FAILED
MOT TEST: 24 May 2016 09:19:33 FAILED

This test (100855873081) was completed on the 24 May 2016 09:19:33 and FAILED the requirements for a valid MOT with 1 comments.

This test (100855873081) was completed on the 24 May 2016 09:19:33 and FAILED the requirements for a valid MOT with 1 comments.

Recorded mileage: 69,512

Recorded mileage: 69,512


PASS WITH RECTIFICATION


MOT TEST: 14 May 2015 17:39:08 PASSED
MOT TEST: 14 May 2015 17:39:08 PASSED

This test (796224735135) was completed on the 14 May 2015 17:39:08 and PASSED the requirements for a valid MOT with 0 comments.

This test (796224735135) was completed on the 14 May 2015 17:39:08 and PASSED the requirements for a valid MOT with 0 comments.

Recorded mileage: 69,174

Recorded mileage: 69,174


MOT TEST: 04 June 2014 13:58:16 PASSED
MOT TEST: 04 June 2014 13:58:16 PASSED

This test (439945554152) was completed on the 04 June 2014 13:58:16 and PASSED the requirements for a valid MOT with 1 comments.

This test (439945554152) was completed on the 04 June 2014 13:58:16 and PASSED the requirements for a valid MOT with 1 comments.

Recorded mileage: 68,532

Recorded mileage: 68,532


ADVISORY


MOT TEST: 27 May 2014 12:14:41 FAILED
MOT TEST: 27 May 2014 12:14:41 FAILED

This test (176827944183) was completed on the 27 May 2014 12:14:41 and FAILED the requirements for a valid MOT with 8 comments.

This test (176827944183) was completed on the 27 May 2014 12:14:41 and FAILED the requirements for a valid MOT with 8 comments.

Recorded mileage: 68,513

Recorded mileage: 68,513


ADVISORY

FAIL


MOT TEST: 31 May 2013 15:31:04 PASSED
MOT TEST: 31 May 2013 15:31:04 PASSED

This test (399761953190) was completed on the 31 May 2013 15:31:04 and PASSED the requirements for a valid MOT with 0 comments.

This test (399761953190) was completed on the 31 May 2013 15:31:04 and PASSED the requirements for a valid MOT with 0 comments.

Recorded mileage: 67,966

Recorded mileage: 67,966


MOT TEST: 15 May 2013 15:44:21 FAILED
MOT TEST: 15 May 2013 15:44:21 FAILED

This test (218515133162) was completed on the 15 May 2013 15:44:21 and FAILED the requirements for a valid MOT with 5 comments.

This test (218515133162) was completed on the 15 May 2013 15:44:21 and FAILED the requirements for a valid MOT with 5 comments.

Recorded mileage: 67,966

Recorded mileage: 67,966


FAIL

USER ENTERED


MOT TEST: 25 May 2012 17:52:28 PASSED
MOT TEST: 25 May 2012 17:52:28 PASSED

This test (289566242428) was completed on the 25 May 2012 17:52:28 and PASSED the requirements for a valid MOT with 0 comments.

This test (289566242428) was completed on the 25 May 2012 17:52:28 and PASSED the requirements for a valid MOT with 0 comments.

Recorded mileage: 67,372

Recorded mileage: 67,372


MOT TEST: 25 May 2012 14:48:12 FAILED
MOT TEST: 25 May 2012 14:48:12 FAILED

This test (356136142173) was completed on the 25 May 2012 14:48:12 and FAILED the requirements for a valid MOT with 1 comments.

This test (356136142173) was completed on the 25 May 2012 14:48:12 and FAILED the requirements for a valid MOT with 1 comments.

Recorded mileage: 67,372

Recorded mileage: 67,372


FAIL


MOT TEST: 03 June 2011 16:38:24 PASSED
MOT TEST: 03 June 2011 16:38:24 PASSED

This test (609234651190) was completed on the 03 June 2011 16:38:24 and PASSED the requirements for a valid MOT with 0 comments.

This test (609234651190) was completed on the 03 June 2011 16:38:24 and PASSED the requirements for a valid MOT with 0 comments.

Recorded mileage: 66,788

Recorded mileage: 66,788


MOT TEST: 23 May 2011 17:27:54 FAILED
MOT TEST: 23 May 2011 17:27:54 FAILED

This test (477843141104) was completed on the 23 May 2011 17:27:54 and FAILED the requirements for a valid MOT with 7 comments.

This test (477843141104) was completed on the 23 May 2011 17:27:54 and FAILED the requirements for a valid MOT with 7 comments.

Recorded mileage: 66,788

Recorded mileage: 66,788


FAIL


MOT TEST: 27 May 2010 07:18:51 PASSED
MOT TEST: 27 May 2010 07:18:51 PASSED

This test (980037040128) was completed on the 27 May 2010 07:18:51 and PASSED the requirements for a valid MOT with 0 comments.

This test (980037040128) was completed on the 27 May 2010 07:18:51 and PASSED the requirements for a valid MOT with 0 comments.

Recorded mileage: 66,401

Recorded mileage: 66,401


MOT TEST: 19 May 2010 08:41:22 FAILED
MOT TEST: 19 May 2010 08:41:22 FAILED

This test (304139630137) was completed on the 19 May 2010 08:41:22 and FAILED the requirements for a valid MOT with 9 comments.

This test (304139630137) was completed on the 19 May 2010 08:41:22 and FAILED the requirements for a valid MOT with 9 comments.

Recorded mileage: 66,401

Recorded mileage: 66,401


FAIL


MOT TEST: 27 April 2009 13:54:34 PASSED
MOT TEST: 27 April 2009 13:54:34 PASSED

This test (872907319167) was completed on the 27 April 2009 13:54:34 and PASSED the requirements for a valid MOT with 0 comments.

This test (872907319167) was completed on the 27 April 2009 13:54:34 and PASSED the requirements for a valid MOT with 0 comments.

Recorded mileage: 65,748

Recorded mileage: 65,748


MOT TEST: 02 April 2009 12:54:46 FAILED
MOT TEST: 02 April 2009 12:54:46 FAILED

This test (860642599072) was completed on the 02 April 2009 12:54:46 and FAILED the requirements for a valid MOT with 12 comments.

This test (860642599072) was completed on the 02 April 2009 12:54:46 and FAILED the requirements for a valid MOT with 12 comments.

Recorded mileage: 65,706

Recorded mileage: 65,706


FAIL

USER ENTERED


MOT TEST: 22 May 2008 08:55:50 PASSED
MOT TEST: 22 May 2008 08:55:50 PASSED

This test (541033348111) was completed on the 22 May 2008 08:55:50 and PASSED the requirements for a valid MOT with 1 comments.

This test (541033348111) was completed on the 22 May 2008 08:55:50 and PASSED the requirements for a valid MOT with 1 comments.

Recorded mileage: 63,222

Recorded mileage: 63,222


ADVISORY


MOT TEST: 24 May 2007 16:11:10 PASSED
MOT TEST: 24 May 2007 16:11:10 PASSED

This test (890664047132) was completed on the 24 May 2007 16:11:10 and PASSED the requirements for a valid MOT with 0 comments.

This test (890664047132) was completed on the 24 May 2007 16:11:10 and PASSED the requirements for a valid MOT with 0 comments.

Recorded mileage: 62,524

Recorded mileage: 62,524


MOT TEST: 23 May 2007 09:57:25 FAILED
MOT TEST: 23 May 2007 09:57:25 FAILED

This test (480953347113) was completed on the 23 May 2007 09:57:25 and FAILED the requirements for a valid MOT with 7 comments.

This test (480953347113) was completed on the 23 May 2007 09:57:25 and FAILED the requirements for a valid MOT with 7 comments.

Recorded mileage: 62,524

Recorded mileage: 62,524


FAIL


MOT TEST: 26 May 2006 12:41:41 PASSED
MOT TEST: 26 May 2006 12:41:41 PASSED

This test (254586746131) was completed on the 26 May 2006 12:41:41 and PASSED the requirements for a valid MOT with 0 comments.

This test (254586746131) was completed on the 26 May 2006 12:41:41 and PASSED the requirements for a valid MOT with 0 comments.

Recorded mileage: 61,809

Recorded mileage: 61,809


MOT TEST: 25 May 2006 09:50:17 FAILED
MOT TEST: 25 May 2006 09:50:17 FAILED

This test (434795946168) was completed on the 25 May 2006 09:50:17 and FAILED the requirements for a valid MOT with 3 comments.

This test (434795946168) was completed on the 25 May 2006 09:50:17 and FAILED the requirements for a valid MOT with 3 comments.

Recorded mileage: 61,809

Recorded mileage: 61,809


FAIL