EBP 644H


EBP644H is registered to a Blue 1969, Morris Minor 1000 with a Petrol engine. It Failed its most recent MOT Test on the 04 May 2018

20 unique faults (20 Total) reported in its MOT History (5 Tests).

0 common/recurring faults.

60% (3) MOT Pass Rate and a 40% (2) MOT Failure Rate.

18,150 recorded miles.

EBP 644H


EBP644H is registered to a Blue 1969, Morris Minor 1000 with a Petrol engine. It Failed its most recent MOT Test on the 04 May 2018

20 unique faults (20 Total) reported in its MOT History (5 Tests).

0 common/recurring faults.

60% (3) MOT Pass Rate and a 40% (2) MOT Failure Rate.

18,150 recorded miles.

MOT PASS/Failure rate for EBP 644H

all MOT test results for EBP 644H represented as a percentage
MOT PASS/Failure rate for EBP 644H
all MOT test results for EBP 644H represented as a percentage

PERCENTAGE OF VEHICLE FAULTS WITH EBP 644H

ALL REPORTED FAULTS, DISPLAYED BY PERCENTAGE OF OCCURRENCE DURING ALL MOT TESTS
PERCENTAGE OF VEHICLE FAULTS WITH EBP 644H
ALL REPORTED FAULTS, DISPLAYED BY PERCENTAGE OF OCCURRENCE DURING ALL MOT TESTS
ADVISORY

FAIL

EBP 644H annual Faults by type

ALL REPORTED FAULTS, DISPLAYED over time and categorised by type
EBP 644H annual Faults by type
ALL REPORTED FAULTS, DISPLAYED over time and categorised by type

ALL EBP 644H ADVISORIES [3]

ALL ADVISORIES, ORDERED by OCCURRENCE DURING EBP 644H's MOT HISTORY
ALL EBP 644H ADVISORIES [3]
ALL ADVISORIES, ORDERED by OCCURRENCE DURING EBP 644H's MOT HISTORY
Advisory Faults | source www.vehiclestats.co.uk
Fault Fault Test Date Test Date/Time Reference MOT Test Reference
1 Nearside front suspension component mounting prescribed area is corroded but not considered excessive torsion bar crossmember (2.4.a.3) Nearside front suspension component mounting prescribed area is corroded but not considered excessive torsion bar crossmember (2.4.a.3) 04 May 2018 [16:21] 04/05/2018 195755428635 195755428635
1 Offside front suspension component mounting prescribed area is corroded but not considered excessive torsion bar crossmember (2.4.a.3) Offside front suspension component mounting prescribed area is corroded but not considered excessive torsion bar crossmember (2.4.a.3) 04 May 2018 [16:21] 04/05/2018 195755428635 195755428635
1 Nearside rear hub seal leaking oil Nearside rear hub seal leaking oil 25 April 2018 [12:49] 25/04/2018 502251967588 502251967588

ALL EBP 644H Failure Faults [17]

ALL Failure faults, ORDERED by OCCURRENCE DURING EBP 644H's MOT HISTORY
ALL EBP 644H Failure Faults [17]
ALL Failure faults, ORDERED by OCCURRENCE DURING EBP 644H's MOT HISTORY
Fail Faults | source www.vehiclestats.co.uk
Fault Fault Test Date Test Date/Time Reference MOT Test Reference
1 Registration plate lamp not working (1.1.c.1d) Registration plate lamp not working (1.1.c.1d) 25 April 2018 [12:49] 25/04/2018 502251967588 502251967588
1 Battery insecure (1.9.1) Battery insecure (1.9.1) 25 April 2018 [12:49] 25/04/2018 502251967588 502251967588
1 Offside front headlamp not working on dipped beam (1.7.5a) Offside front headlamp not working on dipped beam (1.7.5a) 25 April 2018 [12:49] 25/04/2018 502251967588 502251967588
1 Offside front headlamp not working on main beam (1.7.5a) Offside front headlamp not working on main beam (1.7.5a) 25 April 2018 [12:49] 25/04/2018 502251967588 502251967588
1 Offside rear fluid suspension unit leaking (2.4.d.2) Offside rear fluid suspension unit leaking (2.4.d.2) 25 April 2018 [12:49] 25/04/2018 502251967588 502251967588
1 Offside rear rear position lamp(s) excessively deteriorated so that it is not visible from a reasonable distance (1.1.a.3d) Offside rear rear position lamp(s) excessively deteriorated so that it is not visible from a reasonable distance (1.1.a.3d) 18 January 2006 [12:11] 18/01/2006 171408116056 171408116056
1 Registration plate lamp not working (1.1.5c) Registration plate lamp not working (1.1.5c) 18 January 2006 [12:11] 18/01/2006 171408116056 171408116056
1 Offside rear shock absorber has a serious fluid leak (2.7.3) Offside rear shock absorber has a serious fluid leak (2.7.3) 18 January 2006 [12:11] 18/01/2006 171408116056 171408116056
1 Nearside front torsion bar attachment bracket corroded and seriously weakened (2.4.e.4c) Nearside front torsion bar attachment bracket corroded and seriously weakened (2.4.e.4c) 18 January 2006 [12:11] 18/01/2006 171408116056 171408116056
1 Offside front torsion bar attachment bracket corroded and seriously weakened (2.4.e.4c) Offside front torsion bar attachment bracket corroded and seriously weakened (2.4.e.4c) 18 January 2006 [12:11] 18/01/2006 171408116056 171408116056
1 Nearside suspension component mounting prescribed area is excessively corroded (2.4.a.3) Nearside suspension component mounting prescribed area is excessively corroded (2.4.a.3) 18 January 2006 [12:11] 18/01/2006 171408116056 171408116056
1 Nearside front suspension arm has excessive play in a pin/bush (2.4.g.2) Nearside front suspension arm has excessive play in a pin/bush (2.4.g.2) 18 January 2006 [12:11] 18/01/2006 171408116056 171408116056
1 Offside front front brake binding (3.7.b.1) Offside front front brake binding (3.7.b.1) 18 January 2006 [12:11] 18/01/2006 171408116056 171408116056
1 Nearside rear rear brake binding (3.7.b.1) Nearside rear rear brake binding (3.7.b.1) 18 January 2006 [12:11] 18/01/2006 171408116056 171408116056
1 Offside front front brake juddering severely (3.7.a.2b) Offside front front brake juddering severely (3.7.a.2b) 18 January 2006 [12:11] 18/01/2006 171408116056 171408116056
1 Offside front suspension component mounting prescribed area is fractured (2.4.a.3) Offside front suspension component mounting prescribed area is fractured (2.4.a.3) 18 January 2006 [12:11] 18/01/2006 171408116056 171408116056
1 Brakes imbalanced across an axle (3.7.b.5b) Brakes imbalanced across an axle (3.7.b.5b) 18 January 2006 [12:11] 18/01/2006 171408116056 171408116056

MOT TEST: 04 May 2018 16:21:00 PASSED
MOT TEST: 04 May 2018 16:21:00 PASSED

This test (195755428635) was completed on the 04 May 2018 16:21:00 and PASSED the requirements for a valid MOT with 2 comments.

This test (195755428635) was completed on the 04 May 2018 16:21:00 and PASSED the requirements for a valid MOT with 2 comments.

Recorded mileage: 18,150

Recorded mileage: 18,150


ADVISORY


MOT TEST: 25 April 2018 12:49:18 FAILED
MOT TEST: 25 April 2018 12:49:18 FAILED

This test (502251967588) was completed on the 25 April 2018 12:49:18 and FAILED the requirements for a valid MOT with 6 comments.

This test (502251967588) was completed on the 25 April 2018 12:49:18 and FAILED the requirements for a valid MOT with 6 comments.

Recorded mileage: 18,132

Recorded mileage: 18,132


ADVISORY

FAIL


MOT TEST: 18 April 2017 14:13:49 PASSED
MOT TEST: 18 April 2017 14:13:49 PASSED

This test (577952819937) was completed on the 18 April 2017 14:13:49 and PASSED the requirements for a valid MOT with 0 comments.

This test (577952819937) was completed on the 18 April 2017 14:13:49 and PASSED the requirements for a valid MOT with 0 comments.

Recorded mileage: 18,073

Recorded mileage: 18,073


MOT TEST: 18 May 2016 12:09:53 PASSED
MOT TEST: 18 May 2016 12:09:53 PASSED

This test (786585290888) was completed on the 18 May 2016 12:09:53 and PASSED the requirements for a valid MOT with 0 comments.

This test (786585290888) was completed on the 18 May 2016 12:09:53 and PASSED the requirements for a valid MOT with 0 comments.

Recorded mileage: 17,985

Recorded mileage: 17,985


MOT TEST: 18 January 2006 12:11:08 FAILED
MOT TEST: 18 January 2006 12:11:08 FAILED

This test (171408116056) was completed on the 18 January 2006 12:11:08 and FAILED the requirements for a valid MOT with 12 comments.

This test (171408116056) was completed on the 18 January 2006 12:11:08 and FAILED the requirements for a valid MOT with 12 comments.

Recorded mileage: 17,975

Recorded mileage: 17,975


FAIL