EBW 620A


EBW620A is registered to a White 1962, Morris Minor 1000 with a Petrol engine. It Failed its most recent MOT Test on the 03 November 2017

10 unique faults (11 Total) reported in its MOT History (6 Tests).

1 common/recurring faults.

67% (4) MOT Pass Rate and a 33% (2) MOT Failure Rate.

8,805 recorded miles.

EBW 620A


EBW620A is registered to a White 1962, Morris Minor 1000 with a Petrol engine. It Failed its most recent MOT Test on the 03 November 2017

10 unique faults (11 Total) reported in its MOT History (6 Tests).

1 common/recurring faults.

67% (4) MOT Pass Rate and a 33% (2) MOT Failure Rate.

8,805 recorded miles.

MOT PASS/Failure rate for EBW 620A

all MOT test results for EBW 620A represented as a percentage
MOT PASS/Failure rate for EBW 620A
all MOT test results for EBW 620A represented as a percentage

PERCENTAGE OF VEHICLE FAULTS WITH EBW 620A

ALL REPORTED FAULTS, DISPLAYED BY PERCENTAGE OF OCCURRENCE DURING ALL MOT TESTS
PERCENTAGE OF VEHICLE FAULTS WITH EBW 620A
ALL REPORTED FAULTS, DISPLAYED BY PERCENTAGE OF OCCURRENCE DURING ALL MOT TESTS
FAIL

EBW 620A annual Faults by type

ALL REPORTED FAULTS, DISPLAYED over time and categorised by type
EBW 620A annual Faults by type
ALL REPORTED FAULTS, DISPLAYED over time and categorised by type

ALL EBW 620A Failure Faults [11]

ALL Failure faults, ORDERED by OCCURRENCE DURING EBW 620A's MOT HISTORY
ALL EBW 620A Failure Faults [11]
ALL Failure faults, ORDERED by OCCURRENCE DURING EBW 620A's MOT HISTORY
Fail Faults | source www.vehiclestats.co.uk
Fault Fault Test Date Test Date/Time Reference MOT Test Reference
2 Nearside headlamp not working on dipped beam (1.7.5a) Nearside headlamp not working on dipped beam (1.7.5a) 26 October 2017 [09:07] 26/10/2017 06 August 2013 [16:26] 06/08/2013 187317253018 187317253018 885528813242 885528813242
1 Offside rear suspension spring mounting prescribed area is excessively corroded floor pan (2.4.a.3) Offside rear suspension spring mounting prescribed area is excessively corroded floor pan (2.4.a.3) 26 October 2017 [09:07] 26/10/2017 187317253018 187317253018
1 Nearside rear suspension spring mounting prescribed area is excessively corroded inner arch (2.4.a.3) Nearside rear suspension spring mounting prescribed area is excessively corroded inner arch (2.4.a.3) 26 October 2017 [09:07] 26/10/2017 187317253018 187317253018
1 Indicator tell tale inoperative (1.4.a.2a) Indicator tell tale inoperative (1.4.a.2a) 26 October 2017 [09:07] 26/10/2017 187317253018 187317253018
1 Nearside front position lamp(s) not working (1.1.a.3b) Nearside front position lamp(s) not working (1.1.a.3b) 06 August 2013 [16:26] 06/08/2013 885528813242 885528813242
1 Nearside headlamp not working on main beam (1.7.5a) Nearside headlamp not working on main beam (1.7.5a) 06 August 2013 [16:26] 06/08/2013 885528813242 885528813242
1 Offside registration plate lamp not working (1.1.c.1d) Offside registration plate lamp not working (1.1.c.1d) 06 August 2013 [16:26] 06/08/2013 885528813242 885528813242
1 Front windscreen washer provides insufficient washer liquid (8.2.3) Front windscreen washer provides insufficient washer liquid (8.2.3) 06 August 2013 [16:26] 06/08/2013 885528813242 885528813242
1 Offside track rod end ball joint dust cover excessively deteriorated so that it no longer prevents the ingress of dirt (2.2.c.1c) Offside track rod end ball joint dust cover excessively deteriorated so that it no longer prevents the ingress of dirt (2.2.c.1c) 06 August 2013 [16:26] 06/08/2013 885528813242 885528813242
1 Nearside track rod end ball joint dust cover excessively deteriorated so that it no longer prevents the ingress of dirt (2.2.c.1c) Nearside track rod end ball joint dust cover excessively deteriorated so that it no longer prevents the ingress of dirt (2.2.c.1c) 06 August 2013 [16:26] 06/08/2013 885528813242 885528813242

MOT TEST: 03 November 2017 14:18:29 PASSED
MOT TEST: 03 November 2017 14:18:29 PASSED

This test (172267231887) was completed on the 03 November 2017 14:18:29 and PASSED the requirements for a valid MOT with 0 comments.

This test (172267231887) was completed on the 03 November 2017 14:18:29 and PASSED the requirements for a valid MOT with 0 comments.

Recorded mileage: 1,069

Recorded mileage: 1,069


MOT TEST: 26 October 2017 09:07:51 FAILED
MOT TEST: 26 October 2017 09:07:51 FAILED

This test (187317253018) was completed on the 26 October 2017 09:07:51 and FAILED the requirements for a valid MOT with 4 comments.

This test (187317253018) was completed on the 26 October 2017 09:07:51 and FAILED the requirements for a valid MOT with 4 comments.

Recorded mileage: 1,069

Recorded mileage: 1,069


FAIL


MOT TEST: 26 October 2016 11:30:23 PASSED
MOT TEST: 26 October 2016 11:30:23 PASSED

This test (428929132031) was completed on the 26 October 2016 11:30:23 and PASSED the requirements for a valid MOT with 0 comments.

This test (428929132031) was completed on the 26 October 2016 11:30:23 and PASSED the requirements for a valid MOT with 0 comments.

Recorded mileage: 1,065

Recorded mileage: 1,065


MOT TEST: 28 November 2014 10:11:38 PASSED
MOT TEST: 28 November 2014 10:11:38 PASSED

This test (807802534313) was completed on the 28 November 2014 10:11:38 and PASSED the requirements for a valid MOT with 0 comments.

This test (807802534313) was completed on the 28 November 2014 10:11:38 and PASSED the requirements for a valid MOT with 0 comments.

Recorded mileage: 8,805

Recorded mileage: 8,805


MOT TEST: 13 August 2013 10:59:56 PASSED
MOT TEST: 13 August 2013 10:59:56 PASSED

This test (789065123276) was completed on the 13 August 2013 10:59:56 and PASSED the requirements for a valid MOT with 0 comments.

This test (789065123276) was completed on the 13 August 2013 10:59:56 and PASSED the requirements for a valid MOT with 0 comments.

Recorded mileage: 604

Recorded mileage: 604


MOT TEST: 06 August 2013 16:26:34 FAILED
MOT TEST: 06 August 2013 16:26:34 FAILED

This test (885528813242) was completed on the 06 August 2013 16:26:34 and FAILED the requirements for a valid MOT with 7 comments.

This test (885528813242) was completed on the 06 August 2013 16:26:34 and FAILED the requirements for a valid MOT with 7 comments.

Recorded mileage: 588

Recorded mileage: 588


FAIL