ESJ 204


ESJ204 is registered to a Maroon 1960, Morris Minor with a Petrol engine. It Failed its most recent MOT Test on the 26 May 2017

39 unique faults (45 Total) reported in its MOT History (16 Tests).

6 common/recurring faults, the most frequent (2 times) is: Vehicle structure has slight corrosion (6.1.A.1).

69% (11) MOT Pass Rate and a 31% (5) MOT Failure Rate.

48,168 recorded miles.

ESJ 204


ESJ204 is registered to a Maroon 1960, Morris Minor with a Petrol engine. It Failed its most recent MOT Test on the 26 May 2017

39 unique faults (45 Total) reported in its MOT History (16 Tests).

6 common/recurring faults, the most frequent (2 times) is: Vehicle structure has slight corrosion (6.1.A.1).

69% (11) MOT Pass Rate and a 31% (5) MOT Failure Rate.

48,168 recorded miles.

MOT PASS/Failure rate for ESJ 204

all MOT test results for ESJ 204 represented as a percentage
MOT PASS/Failure rate for ESJ 204
all MOT test results for ESJ 204 represented as a percentage

PERCENTAGE OF VEHICLE FAULTS WITH ESJ 204

ALL REPORTED FAULTS, DISPLAYED BY PERCENTAGE OF OCCURRENCE DURING ALL MOT TESTS
PERCENTAGE OF VEHICLE FAULTS WITH ESJ 204
ALL REPORTED FAULTS, DISPLAYED BY PERCENTAGE OF OCCURRENCE DURING ALL MOT TESTS
ADVISORY

FAIL

USER ENTERED

ESJ 204 annual Faults by type

ALL REPORTED FAULTS, DISPLAYED over time and categorised by type
ESJ 204 annual Faults by type
ALL REPORTED FAULTS, DISPLAYED over time and categorised by type

RECURRING FAULTS WITH ESJ 204

FAULTS THAT HAVE OCCURED MORE THAN ONCE DURING ESJ 204's MOT HISTORY
RECURRING FAULTS WITH ESJ 204
FAULTS THAT HAVE OCCURED MORE THAN ONCE DURING ESJ 204's MOT HISTORY
Fault Fault Test Date Test Date/Time Reference MOT Test Reference
2 Vehicle structure has slight corrosion (6.1.a.1) Vehicle structure has slight corrosion (6.1.a.1) 26 May 2017 [08:00] 26/05/2017 23 May 2017 [13:56] 23/05/2017 272565127889 272565127889 528819434947 528819434947
2 Body has slight corrosion (6.1.b.2) Body has slight corrosion (6.1.b.2) 26 May 2017 [08:00] 26/05/2017 23 May 2017 [13:56] 23/05/2017 272565127889 272565127889 528819434947 528819434947
2 Parking brake: efficiency below requirements (3.7.b.7) Parking brake: efficiency below requirements (3.7.b.7) 23 May 2017 [13:56] 23/05/2017 29 May 2007 [17:27] 29/05/2007 528819434947 528819434947 591989047134 591989047134
2 Offside rear service brake: service brake efficiency only just met. It would appear that the braking system requires adjustment or repair. (3.7.b.7) Offside rear service brake: service brake efficiency only just met. It would appear that the braking system requires adjustment or repair. (3.7.b.7) 11 May 2015 [09:58] 11/05/2015 02 May 2013 [12:49] 02/05/2013 986581435157 986581435157 118832623158 118832623158
2 Offside rear parking brake: parking brake efficiency only just met. It would appear that the braking system requires adjustment or repair. (3.7.b.7) Offside rear parking brake: parking brake efficiency only just met. It would appear that the braking system requires adjustment or repair. (3.7.b.7) 11 May 2015 [09:58] 11/05/2015 02 May 2013 [12:49] 02/05/2013 986581435157 986581435157 118832623158 118832623158
2 Offside rear suspension spring mounting prescribed area is excessively corroded (2.4.a.3) Offside rear suspension spring mounting prescribed area is excessively corroded (2.4.a.3) 02 November 2010 [09:51] 02/11/2010 20 July 2009 [19:09] 20/07/2009 444476300466 444476300466 131201709262 131201709262

ALL ESJ 204 ADVISORIES [15]

ALL ADVISORIES, ORDERED by OCCURRENCE DURING ESJ 204's MOT HISTORY
ALL ESJ 204 ADVISORIES [15]
ALL ADVISORIES, ORDERED by OCCURRENCE DURING ESJ 204's MOT HISTORY
Advisory Faults | source www.vehiclestats.co.uk
Fault Fault Test Date Test Date/Time Reference MOT Test Reference
2 Vehicle structure has slight corrosion (6.1.a.1) Vehicle structure has slight corrosion (6.1.a.1) 26 May 2017 [08:00] 26/05/2017 23 May 2017 [13:56] 23/05/2017 272565127889 272565127889 528819434947 528819434947
2 Body has slight corrosion (6.1.b.2) Body has slight corrosion (6.1.b.2) 26 May 2017 [08:00] 26/05/2017 23 May 2017 [13:56] 23/05/2017 272565127889 272565127889 528819434947 528819434947
2 Offside rear service brake: service brake efficiency only just met. It would appear that the braking system requires adjustment or repair. (3.7.b.7) Offside rear service brake: service brake efficiency only just met. It would appear that the braking system requires adjustment or repair. (3.7.b.7) 11 May 2015 [09:58] 11/05/2015 02 May 2013 [12:49] 02/05/2013 986581435157 986581435157 118832623158 118832623158
2 Offside rear parking brake: parking brake efficiency only just met. It would appear that the braking system requires adjustment or repair. (3.7.b.7) Offside rear parking brake: parking brake efficiency only just met. It would appear that the braking system requires adjustment or repair. (3.7.b.7) 11 May 2015 [09:58] 11/05/2015 02 May 2013 [12:49] 02/05/2013 986581435157 986581435157 118832623158 118832623158
1 Under side of car carroded Under side of car carroded 12 May 2016 [10:53] 12/05/2016 384938256215 384938256215
1 Nearside nsr sill carroded Nearside nsr sill carroded 12 May 2016 [10:53] 12/05/2016 384938256215 384938256215
1 Rear inner boot floor carroded Rear inner boot floor carroded 12 May 2016 [10:53] 12/05/2016 384938256215 384938256215
1 Nearside seat belt anchorage prescribed area is corroded but not considered excessive (5.2.6) Nearside seat belt anchorage prescribed area is corroded but not considered excessive (5.2.6) 28 April 2014 [10:49] 28/04/2014 955778514126 955778514126
1 Nearside front brake hose slightly deteriorated (3.6.b.4d) Nearside front brake hose slightly deteriorated (3.6.b.4d) 02 May 2013 [12:49] 02/05/2013 118832623158 118832623158
1 Offside front tyre worn close to the legal limit (4.1.e.1) Offside front tyre worn close to the legal limit (4.1.e.1) 20 July 2009 [19:09] 20/07/2009 131201709262 131201709262
1 Nearside rear upper suspension component mounting prescribed area is corroded but not considered excessive (2.4.a.3) Nearside rear upper suspension component mounting prescribed area is corroded but not considered excessive (2.4.a.3) 20 July 2009 [19:09] 20/07/2009 131201709262 131201709262

ALL ESJ 204 Failure Faults [25]

ALL Failure faults, ORDERED by OCCURRENCE DURING ESJ 204's MOT HISTORY
ALL ESJ 204 Failure Faults [25]
ALL Failure faults, ORDERED by OCCURRENCE DURING ESJ 204's MOT HISTORY
Fail Faults | source www.vehiclestats.co.uk
Fault Fault Test Date Test Date/Time Reference MOT Test Reference
2 Parking brake: efficiency below requirements (3.7.b.7) Parking brake: efficiency below requirements (3.7.b.7) 23 May 2017 [13:56] 23/05/2017 29 May 2007 [17:27] 29/05/2007 528819434947 528819434947 591989047134 591989047134
2 Offside rear suspension spring mounting prescribed area is excessively corroded (2.4.a.3) Offside rear suspension spring mounting prescribed area is excessively corroded (2.4.a.3) 02 November 2010 [09:51] 02/11/2010 20 July 2009 [19:09] 20/07/2009 444476300466 444476300466 131201709262 131201709262
1 Service brake: efficiency below requirements (3.7.b.7) Service brake: efficiency below requirements (3.7.b.7) 23 May 2017 [13:56] 23/05/2017 528819434947 528819434947
1 Rear brakes imbalanced across an axle axle 2 (3.7.b.5b) Rear brakes imbalanced across an axle axle 2 (3.7.b.5b) 23 May 2017 [13:56] 23/05/2017 528819434947 528819434947
1 Rear rear brake recording little or no effort (3.7.b.5a) Rear rear brake recording little or no effort (3.7.b.5a) 23 May 2017 [13:56] 23/05/2017 528819434947 528819434947
1 Rear rear parking brake recording little or no effort (3.7.b.6a) Rear rear parking brake recording little or no effort (3.7.b.6a) 23 May 2017 [13:56] 23/05/2017 528819434947 528819434947
1 Offside front headlamp not working on main beam (1.7.5a) Offside front headlamp not working on main beam (1.7.5a) 16 April 2012 [10:14] 16/04/2012 127387202147 127387202147
1 Nearside front headlamp not working on dipped beam (1.7.5a) Nearside front headlamp not working on dipped beam (1.7.5a) 16 April 2012 [10:14] 16/04/2012 127387202147 127387202147
1 Offside front steering component mounting prescribed area is excessively corroded (2.2.c.1h) Offside front steering component mounting prescribed area is excessively corroded (2.2.c.1h) 16 April 2012 [10:14] 16/04/2012 127387202147 127387202147
1 Offside front front brake recording little or no effort (3.7.b.5a) Offside front front brake recording little or no effort (3.7.b.5a) 16 April 2012 [10:14] 16/04/2012 127387202147 127387202147
1 Nearside headlamp not working on dipped beam (1.7.5a) Nearside headlamp not working on dipped beam (1.7.5a) 02 November 2010 [09:51] 02/11/2010 444476300466 444476300466
1 Nearside rear suspension spring mounting prescribed area is excessively corroded (2.4.a.3) Nearside rear suspension spring mounting prescribed area is excessively corroded (2.4.a.3) 02 November 2010 [09:51] 02/11/2010 444476300466 444476300466
1 Nearside front suspension component mounting prescribed area is excessively corroded (2.4.a.3) Nearside front suspension component mounting prescribed area is excessively corroded (2.4.a.3) 02 November 2010 [09:51] 02/11/2010 444476300466 444476300466
1 Nearside front lower axle swivel joint has excessive play in a swivel pin (2.5.a.3b) Nearside front lower axle swivel joint has excessive play in a swivel pin (2.5.a.3b) 02 November 2010 [09:51] 02/11/2010 444476300466 444476300466
1 Offside front lower seat belt anchorage prescribed area is excessively corroded (5.2.6) Offside front lower seat belt anchorage prescribed area is excessively corroded (5.2.6) 20 July 2009 [19:09] 20/07/2009 131201709262 131201709262
1 Offside rear torsion bar attachment bracket corroded and seriously weakened (2.4.e.4c) Offside rear torsion bar attachment bracket corroded and seriously weakened (2.4.e.4c) 20 July 2009 [19:09] 20/07/2009 131201709262 131201709262
1 Offside front brake hose twisted (found during steering lock to lock check) (2.2.d.2b) Offside front brake hose twisted (found during steering lock to lock check) (2.2.d.2b) 29 May 2007 [17:27] 29/05/2007 591989047134 591989047134
1 Offside rear braking system leaking (3.6.a.1) Offside rear braking system leaking (3.6.a.1) 29 May 2007 [17:27] 29/05/2007 591989047134 591989047134
1 Steering system excessively rough (2.2.d.1) Steering system excessively rough (2.2.d.1) 29 May 2007 [17:27] 29/05/2007 591989047134 591989047134
1 Nearside front suspension arm has excessive play in a pin/bush (2.4.g.2) Nearside front suspension arm has excessive play in a pin/bush (2.4.g.2) 29 May 2007 [17:27] 29/05/2007 591989047134 591989047134
1 Nearside front tyre tread depth below requirements of 1.6mm (4.1.e.1) Nearside front tyre tread depth below requirements of 1.6mm (4.1.e.1) 29 May 2007 [17:27] 29/05/2007 591989047134 591989047134
1 Nearside front tie bar/rod rubber bush deteriorated resulting in excessive movement (2.4.g.2) Nearside front tie bar/rod rubber bush deteriorated resulting in excessive movement (2.4.g.2) 29 May 2007 [17:27] 29/05/2007 591989047134 591989047134
1 Offside front tie bar/rod rubber bush deteriorated resulting in excessive movement (2.4.g.2) Offside front tie bar/rod rubber bush deteriorated resulting in excessive movement (2.4.g.2) 29 May 2007 [17:27] 29/05/2007 591989047134 591989047134

ALL ESJ 204 User Entered Faults [5]

ALL User Entered faults, ORDERED by OCCURRENCE DURING ESJ 204's MOT HISTORY
ALL ESJ 204 User Entered Faults [5]
ALL User Entered faults, ORDERED by OCCURRENCE DURING ESJ 204's MOT HISTORY
Fail Faults | source www.vehiclestats.co.uk
Fault Fault Test Date Test Date/Time Reference MOT Test Reference
1 Corrosion in engine bay at nearside front. Corrosion in engine bay at nearside front. 02 November 2010 [09:51] 02/11/2010 444476300466 444476300466
1 Rear exhaust mounting broken. Rear exhaust mounting broken. 02 November 2010 [09:51] 02/11/2010 444476300466 444476300466
1 Nearside front inner sill corroded. Nearside front inner sill corroded. 02 November 2010 [09:51] 02/11/2010 444476300466 444476300466
1 Offside front suspension lower swivel joint wearing. Offside front suspension lower swivel joint wearing. 02 November 2010 [09:51] 02/11/2010 444476300466 444476300466
1 Nearside front brake hose deteriorating. Nearside front brake hose deteriorating. 02 November 2010 [09:51] 02/11/2010 444476300466 444476300466

MOT TEST: 26 May 2017 08:00:08 PASSED
MOT TEST: 26 May 2017 08:00:08 PASSED

This test (272565127889) was completed on the 26 May 2017 08:00:08 and PASSED the requirements for a valid MOT with 2 comments.

This test (272565127889) was completed on the 26 May 2017 08:00:08 and PASSED the requirements for a valid MOT with 2 comments.

Recorded mileage: 48,168

Recorded mileage: 48,168


ADVISORY


MOT TEST: 23 May 2017 13:56:46 FAILED
MOT TEST: 23 May 2017 13:56:46 FAILED

This test (528819434947) was completed on the 23 May 2017 13:56:46 and FAILED the requirements for a valid MOT with 7 comments.

This test (528819434947) was completed on the 23 May 2017 13:56:46 and FAILED the requirements for a valid MOT with 7 comments.

Recorded mileage: 48,168

Recorded mileage: 48,168


ADVISORY

FAIL


MOT TEST: 12 May 2016 10:53:46 PASSED
MOT TEST: 12 May 2016 10:53:46 PASSED

This test (384938256215) was completed on the 12 May 2016 10:53:46 and PASSED the requirements for a valid MOT with 3 comments.

This test (384938256215) was completed on the 12 May 2016 10:53:46 and PASSED the requirements for a valid MOT with 3 comments.

Recorded mileage: 48,168

Recorded mileage: 48,168


ADVISORY


MOT TEST: 11 May 2015 09:58:00 PASSED
MOT TEST: 11 May 2015 09:58:00 PASSED

This test (986581435157) was completed on the 11 May 2015 09:58:00 and PASSED the requirements for a valid MOT with 2 comments.

This test (986581435157) was completed on the 11 May 2015 09:58:00 and PASSED the requirements for a valid MOT with 2 comments.

Recorded mileage: 48,168

Recorded mileage: 48,168


ADVISORY


MOT TEST: 28 April 2014 10:49:44 PASSED
MOT TEST: 28 April 2014 10:49:44 PASSED

This test (955778514126) was completed on the 28 April 2014 10:49:44 and PASSED the requirements for a valid MOT with 1 comments.

This test (955778514126) was completed on the 28 April 2014 10:49:44 and PASSED the requirements for a valid MOT with 1 comments.

Recorded mileage: 48,168

Recorded mileage: 48,168


ADVISORY


MOT TEST: 02 May 2013 12:49:51 PASSED
MOT TEST: 02 May 2013 12:49:51 PASSED

This test (118832623158) was completed on the 02 May 2013 12:49:51 and PASSED the requirements for a valid MOT with 3 comments.

This test (118832623158) was completed on the 02 May 2013 12:49:51 and PASSED the requirements for a valid MOT with 3 comments.

Recorded mileage: 48,168

Recorded mileage: 48,168


ADVISORY


MOT TEST: 30 April 2012 13:43:02 PASSED
MOT TEST: 30 April 2012 13:43:02 PASSED

This test (686251222114) was completed on the 30 April 2012 13:43:02 and PASSED the requirements for a valid MOT with 0 comments.

This test (686251222114) was completed on the 30 April 2012 13:43:02 and PASSED the requirements for a valid MOT with 0 comments.

Recorded mileage: 48,168

Recorded mileage: 48,168


MOT TEST: 16 April 2012 10:14:30 FAILED
MOT TEST: 16 April 2012 10:14:30 FAILED

This test (127387202147) was completed on the 16 April 2012 10:14:30 and FAILED the requirements for a valid MOT with 4 comments.

This test (127387202147) was completed on the 16 April 2012 10:14:30 and FAILED the requirements for a valid MOT with 4 comments.

Recorded mileage: 48,168

Recorded mileage: 48,168


FAIL


MOT TEST: 25 April 2011 16:51:43 PASSED
MOT TEST: 25 April 2011 16:51:43 PASSED

This test (997075911165) was completed on the 25 April 2011 16:51:43 and PASSED the requirements for a valid MOT with 0 comments.

This test (997075911165) was completed on the 25 April 2011 16:51:43 and PASSED the requirements for a valid MOT with 0 comments.

Recorded mileage: 48,168

Recorded mileage: 48,168


MOT TEST: 02 November 2010 09:51:42 FAILED
MOT TEST: 02 November 2010 09:51:42 FAILED

This test (444476300466) was completed on the 02 November 2010 09:51:42 and FAILED the requirements for a valid MOT with 10 comments.

This test (444476300466) was completed on the 02 November 2010 09:51:42 and FAILED the requirements for a valid MOT with 10 comments.

Recorded mileage: 48,168

Recorded mileage: 48,168


FAIL

USER ENTERED


MOT TEST: 25 September 2009 12:05:23 PASSED
MOT TEST: 25 September 2009 12:05:23 PASSED

This test (202708869213) was completed on the 25 September 2009 12:05:23 and PASSED the requirements for a valid MOT with 0 comments.

This test (202708869213) was completed on the 25 September 2009 12:05:23 and PASSED the requirements for a valid MOT with 0 comments.

Recorded mileage: 48,168

Recorded mileage: 48,168


MOT TEST: 20 July 2009 19:09:34 FAILED
MOT TEST: 20 July 2009 19:09:34 FAILED

This test (131201709262) was completed on the 20 July 2009 19:09:34 and FAILED the requirements for a valid MOT with 5 comments.

This test (131201709262) was completed on the 20 July 2009 19:09:34 and FAILED the requirements for a valid MOT with 5 comments.

Recorded mileage: 48,168

Recorded mileage: 48,168


ADVISORY

FAIL


MOT TEST: 05 July 2008 11:05:30 PASSED
MOT TEST: 05 July 2008 11:05:30 PASSED

This test (334157888153) was completed on the 05 July 2008 11:05:30 and PASSED the requirements for a valid MOT with 0 comments.

This test (334157888153) was completed on the 05 July 2008 11:05:30 and PASSED the requirements for a valid MOT with 0 comments.

Recorded mileage: 48,168

Recorded mileage: 48,168


MOT TEST: 12 July 2007 17:34:48 PASSED
MOT TEST: 12 July 2007 17:34:48 PASSED

This test (370273997191) was completed on the 12 July 2007 17:34:48 and PASSED the requirements for a valid MOT with 0 comments.

This test (370273997191) was completed on the 12 July 2007 17:34:48 and PASSED the requirements for a valid MOT with 0 comments.

Recorded mileage: 48,168

Recorded mileage: 48,168


MOT TEST: 29 May 2007 17:27:14 FAILED
MOT TEST: 29 May 2007 17:27:14 FAILED

This test (591989047134) was completed on the 29 May 2007 17:27:14 and FAILED the requirements for a valid MOT with 8 comments.

This test (591989047134) was completed on the 29 May 2007 17:27:14 and FAILED the requirements for a valid MOT with 8 comments.

Recorded mileage: 48,168

Recorded mileage: 48,168


FAIL


MOT TEST: 26 June 2006 18:56:08 PASSED
MOT TEST: 26 June 2006 18:56:08 PASSED

This test (472767176148) was completed on the 26 June 2006 18:56:08 and PASSED the requirements for a valid MOT with 0 comments.

This test (472767176148) was completed on the 26 June 2006 18:56:08 and PASSED the requirements for a valid MOT with 0 comments.

Recorded mileage: 48,168

Recorded mileage: 48,168