ESJ 288


ESJ288 is registered to a Black 1955, Morris Minor with a Petrol engine. It Failed its most recent MOT Test on the 14 October 2010

13 unique faults (14 Total) reported in its MOT History (7 Tests).

1 common/recurring faults.

57% (4) MOT Pass Rate and a 43% (3) MOT Failure Rate.

41,132 recorded miles.

ESJ 288


ESJ288 is registered to a Black 1955, Morris Minor with a Petrol engine. It Failed its most recent MOT Test on the 14 October 2010

13 unique faults (14 Total) reported in its MOT History (7 Tests).

1 common/recurring faults.

57% (4) MOT Pass Rate and a 43% (3) MOT Failure Rate.

41,132 recorded miles.

MOT PASS/Failure rate for ESJ 288

all MOT test results for ESJ 288 represented as a percentage
MOT PASS/Failure rate for ESJ 288
all MOT test results for ESJ 288 represented as a percentage

PERCENTAGE OF VEHICLE FAULTS WITH ESJ 288

ALL REPORTED FAULTS, DISPLAYED BY PERCENTAGE OF OCCURRENCE DURING ALL MOT TESTS
PERCENTAGE OF VEHICLE FAULTS WITH ESJ 288
ALL REPORTED FAULTS, DISPLAYED BY PERCENTAGE OF OCCURRENCE DURING ALL MOT TESTS
FAIL

ESJ 288 annual Faults by type

ALL REPORTED FAULTS, DISPLAYED over time and categorised by type
ESJ 288 annual Faults by type
ALL REPORTED FAULTS, DISPLAYED over time and categorised by type

ALL ESJ 288 Failure Faults [14]

ALL Failure faults, ORDERED by OCCURRENCE DURING ESJ 288's MOT HISTORY
ALL ESJ 288 Failure Faults [14]
ALL Failure faults, ORDERED by OCCURRENCE DURING ESJ 288's MOT HISTORY
Fail Faults | source www.vehiclestats.co.uk
Fault Fault Test Date Test Date/Time Reference MOT Test Reference
2 Nearside rear parking brake recording little or no effort (3.7.b.6a) Nearside rear parking brake recording little or no effort (3.7.b.6a) 13 October 2010 [10:12] 13/10/2010 25 September 2009 [11:50] 25/09/2009 210966280280 210966280280 692908169297 692908169297
1 Parking brake: efficiency below requirements (3.7.b.7) Parking brake: efficiency below requirements (3.7.b.7) 13 October 2010 [10:12] 13/10/2010 210966280280 210966280280
1 Nearside rear position lamp(s) excessively deteriorated so that it is not visible from a reasonable distance (1.1.a.3d) Nearside rear position lamp(s) excessively deteriorated so that it is not visible from a reasonable distance (1.1.a.3d) 25 September 2009 [11:50] 25/09/2009 692908169297 692908169297
1 Offside semaphore indicator arm arm does not show an amber light to the front (1.4.c.1b) Offside semaphore indicator arm arm does not show an amber light to the front (1.4.c.1b) 25 September 2009 [11:50] 25/09/2009 692908169297 692908169297
1 Offside semaphore indicator arm arm does not show an amber light to the rear (1.4.c.1b) Offside semaphore indicator arm arm does not show an amber light to the rear (1.4.c.1b) 25 September 2009 [11:50] 25/09/2009 692908169297 692908169297
1 Fuel cap/sealing device sealing washer missing (7.2.4c) Fuel cap/sealing device sealing washer missing (7.2.4c) 25 September 2009 [11:50] 25/09/2009 692908169297 692908169297
1 Nearside rear brake recording little or no effort (3.7.b.5a) Nearside rear brake recording little or no effort (3.7.b.5a) 25 September 2009 [11:50] 25/09/2009 692908169297 692908169297
1 Front front brake application uneven (3.7.b.2) Front front brake application uneven (3.7.b.2) 25 September 2009 [11:50] 25/09/2009 692908169297 692908169297
1 Nearside headlamp aim too high (1.8) Nearside headlamp aim too high (1.8) 11 September 2007 [12:48] 11/09/2007 311124957463 311124957463
1 Offside headlamp aim too high (1.8) Offside headlamp aim too high (1.8) 11 September 2007 [12:48] 11/09/2007 311124957463 311124957463
1 Offside axle swivel joint has excessive play in a swivel pin (2.5.a.3b) Offside axle swivel joint has excessive play in a swivel pin (2.5.a.3b) 11 September 2007 [12:48] 11/09/2007 311124957463 311124957463
1 Brake pedal spongy (3.3.b.1b) Brake pedal spongy (3.3.b.1b) 11 September 2007 [12:48] 11/09/2007 311124957463 311124957463
1 Nearside rear tyre incorrectly seated on the wheel rim (4.1.d.1d) Nearside rear tyre incorrectly seated on the wheel rim (4.1.d.1d) 11 September 2007 [12:48] 11/09/2007 311124957463 311124957463

MOT TEST: 14 October 2010 15:29:18 PASSED
MOT TEST: 14 October 2010 15:29:18 PASSED

This test (434277680274) was completed on the 14 October 2010 15:29:18 and PASSED the requirements for a valid MOT with 0 comments.

This test (434277680274) was completed on the 14 October 2010 15:29:18 and PASSED the requirements for a valid MOT with 0 comments.

Recorded mileage: 41,132

Recorded mileage: 41,132


MOT TEST: 13 October 2010 10:12:19 FAILED
MOT TEST: 13 October 2010 10:12:19 FAILED

This test (210966280280) was completed on the 13 October 2010 10:12:19 and FAILED the requirements for a valid MOT with 2 comments.

This test (210966280280) was completed on the 13 October 2010 10:12:19 and FAILED the requirements for a valid MOT with 2 comments.

Recorded mileage: 41,124

Recorded mileage: 41,124


FAIL


MOT TEST: 02 October 2009 14:14:17 PASSED
MOT TEST: 02 October 2009 14:14:17 PASSED

This test (993605779258) was completed on the 02 October 2009 14:14:17 and PASSED the requirements for a valid MOT with 0 comments.

This test (993605779258) was completed on the 02 October 2009 14:14:17 and PASSED the requirements for a valid MOT with 0 comments.

Recorded mileage: 38,236

Recorded mileage: 38,236


MOT TEST: 25 September 2009 11:50:55 FAILED
MOT TEST: 25 September 2009 11:50:55 FAILED

This test (692908169297) was completed on the 25 September 2009 11:50:55 and FAILED the requirements for a valid MOT with 7 comments.

This test (692908169297) was completed on the 25 September 2009 11:50:55 and FAILED the requirements for a valid MOT with 7 comments.

Recorded mileage: 38,224

Recorded mileage: 38,224


FAIL


MOT TEST: 31 July 2008 12:23:39 PASSED
MOT TEST: 31 July 2008 12:23:39 PASSED

This test (932473818281) was completed on the 31 July 2008 12:23:39 and PASSED the requirements for a valid MOT with 0 comments.

This test (932473818281) was completed on the 31 July 2008 12:23:39 and PASSED the requirements for a valid MOT with 0 comments.

Recorded mileage: 37,084

Recorded mileage: 37,084


MOT TEST: 11 September 2007 12:48:58 FAILED
MOT TEST: 11 September 2007 12:48:58 FAILED

This test (311124957463) was completed on the 11 September 2007 12:48:58 and FAILED the requirements for a valid MOT with 5 comments.

This test (311124957463) was completed on the 11 September 2007 12:48:58 and FAILED the requirements for a valid MOT with 5 comments.

Recorded mileage: 37,075

Recorded mileage: 37,075


FAIL


MOT TEST: 04 November 2006 13:58:08 PASSED
MOT TEST: 04 November 2006 13:58:08 PASSED

This test (141778906382) was completed on the 04 November 2006 13:58:08 and PASSED the requirements for a valid MOT with 0 comments.

This test (141778906382) was completed on the 04 November 2006 13:58:08 and PASSED the requirements for a valid MOT with 0 comments.

Recorded mileage: 35,823

Recorded mileage: 35,823